program: Gaussian 09
title: 000114883
version: EM64L-G09RevD.01
frameworkgroup: C1[X(C7H7N5O2)]
method: RPBEPBE
basis: SDD
operation: Freq
keyword: #pfreq=noraman
keyword: PBEPBE/SDD
title: #p freq=noraman PBEPBE/SDD
converged: YES YES NO NO
title: Mulliken charges:
elementType: O O N N N N N C C C C C C C H H H H H H H
charge: -0.282562 -0.178217 -0.157529 -0.381487 -0.096285 -0.048763 -0.620476 0.087159 0.091305 -0.445593 -0.179440 0.042931 0.167530 -0.025179 0.319779 0.253223 0.276873 0.323913 0.180793 0.314773 0.357252
chargesum: 0.00000
title: Mulliken charges with hydrogens summed into heavy atoms:
elementType: O O N N N N N C C C C C C C
charge: -0.282562 -0.178217 -0.157529 -0.057574 -0.096285 -0.048763 0.051548 0.087159 0.091305 0.127410 0.097434 0.042931 0.167530 0.155614
polarizability: 1.65701737e+02 4.74500303e+00 1.22747561e+02 -8.68819925e+00 -4.04151729e+00 5.98618262e+01
1716.lowfreq: -7.9835 -5.4439 -0.0008 -0.0006 -0.0005 6.1853 29.0488 75.7513 115.0138
frequency: 29.0400 75.7427 115.0127 152.0869 157.0395 200.6915 222.3173 248.8529 265.4130 332.8890 360.8164 373.0919 457.3965 492.9092 521.1659 571.2969 594.3271 604.2786 618.9612 655.8209 668.8459 695.9143 727.9118 765.5630 789.6014 807.6638 818.0919 923.9329 955.0506 998.1540 1035.4475 1085.5143 1154.0318 1187.1493 1202.4018 1251.8384 1289.6576 1315.1020 1350.4982 1364.7967 1378.0453 1411.8521 1422.5592 1460.3209 1503.3719 1526.3604 1587.1577 1610.9026 1633.1770 1656.3450 2892.0965 2914.8727 2995.5121 3258.4342 3546.6420 3556.2325 3707.4003
redmass: 8.1492 6.5785 6.1965 2.9185 7.2827 6.1643 3.2237 2.5741 1.4187 3.6281 6.8847 5.1188 5.6789 8.3668 1.1353 1.1891 4.8957 6.4206 4.4143 5.7832 9.8113 9.0032 1.3768 7.0870 2.4659 2.8135 4.8911 3.3763 5.0022 2.0156 1.9299 3.7541 3.5233 2.6044 1.5245 2.1032 1.7301 3.9285 2.7013 2.4576 1.2375 5.2857 2.6592 1.3762 6.5235 4.5613 2.1078 5.6183 2.2079 7.3552 1.0847 1.0722 1.0905 1.0994 1.0738 1.0498 1.1054
irintensity: 1.2116 20.5426 5.1093 15.1449 0.1119 1.0633 17.4923 19.4175 43.5989 5.5937 16.5018 3.9170 9.8572 2.0499 342.8573 45.8143 10.5467 3.1334 24.5573 2.8064 0.2271 10.4978 4.6182 5.3208 21.6744 8.8014 8.7958 9.2001 36.6845 56.2577 2.2044 6.0008 4.0641 72.7795 21.9842 41.5475 54.3029 5.2389 22.5822 173.6511 6.7256 84.2139 31.0159 80.9411 74.4189 308.5622 74.2507 281.5192 633.6815 112.7926 95.7681 202.8665 13.0942 2.2344 50.1882 118.3224 46.8250
temp: 298.150 k
press: 1.00000 atm
elementType: 8 8 7 7 7 7 7 6 6 6 6 6 6 6 1 1 1 1 1 1 1
symmnumber: 1
zpe: 391762.6 jmol-1
zpe.correction: 0.149215 hartree
zpe.thermalcorrener: 0.161274 hartree
zpe.thermalcorrenthalpy: 0.162218 hartree
zpe.thermalcorrgfe: 0.110316 hartree
zpe.sumelectzpe: -694.145439 hartree
zpe.sumelectthermal: -694.133379 hartree
zpe.sumelectthermalent: -694.132435 hartree
zpe.sumelectthermalfe: -694.184338 hartree
dipole: -2.5512 -2.8480 -1.5969
dipole: 4.1436
quadrupole: -49.0334 -94.1371 -83.1543
quadrupole: 16.4895 -13.0035 0.7621
quadrupole: 26.4082 -18.6955 -7.7128 16.4895 -13.0035 0.7621
hfenergy: -694.2946534 hartree
pointgroup: C01 [X(C7H7N5O2)]
dipole: 1.0576654 -1.1795055 0.3843215 debye
dipolederiv: -0.9612277 0.3048239 0.0994721 0.3283596 -1.0531271 -0.1860438 0.1612946 -0.1940561 -0.4369205 -0.5093072 0.026518 -0.0937876 -0.0530232 -0.3878492 -0.2286 -0.3911094 -0.1313502 -0.6632802 -0.5344137 0.1892585 0.0567852 0.3339267 -0.3347649 -0.114565 0.0432032 -0.0702524 -0.1445901 -0.9063606 0.0022837 0.0892323 -0.3944656 -0.7030981 -0.0323343 0.0227316 -0.0959645 -0.2686888 -0.7670925 0.1124369 0.0576461 -0.0773859 -0.358129 0.0074353 0.0610497 -0.0297329 -0.2608878 -1.5732686 0.3130527 0.2317463 0.5421926 -0.6661522 -0.1466283 0.3143029 -0.1230217 -0.3918278 -1.7051319 -0.0727753 0.1097863 -0.0288955 -0.2462075 0.1195467 0.1189784 0.1257296 -0.729922 0.1445564 -0.1911655 -0.038702 -0.0141778 -0.7377593 -0.1232812 -0.0174491 -0.1304936 -0.0160826 0.8650817 -0.0063235 -0.1163023 0.3032986 0.2959104 0.0213192 -0.0606285 0.0445397 0.0891601 0.0371494 -0.1198003 -0.2888022 -0.4362122 0.092312 -0.0918955 -0.5048729 -0.040709 -0.0238922 0.3399102 -0.2707905 -0.0784038 -0.4266922 0.3524073 0.1076556 -0.0249022 0.1493204 -0.0010965 1.6800104 -0.2627117 -0.2378696 -0.3309151 1.4171304 0.2555341 -0.2976526 0.2943956 0.3274503 2.1479579 0.0117503 -0.2760974 -0.1392297 1.1338216 0.1977886 -0.3313499 0.1805565 0.3380459 0.9002665 -0.207406 0.3133176 -0.1672251 0.3991 0.3265631 0.5842635 0.2432988 0.764438 0.34778 -0.0029003 -0.0162893 0.2625053 0.0967548 0.0380384 0.0327269 0.0191176 0.1453193 -0.0392401 0.0426463 0.0641985 0.0790789 0.0963002 0.0825114 0.1273855 -0.0017565 -0.0146863 0.0290607 -0.0249183 0.0186403 -0.0156348 0.1224712 -0.0070225 -0.0066913 -0.0213203 0.1637264 0.1611087 -0.0400436 0.0212172 -0.0048746 0.1908144 -0.0341141 0.0279266 -0.0261578 0.3385665 -0.18739 0.1613697 0.0258658 0.1848985 -0.0582397 -0.0836682 0.0635116 -0.0855449 0.0251368 0.2470453 -0.0058502 0.0266044 -0.0322839 0.1375988 -0.0560255 0.0332487 -0.0615006 0.3798791 0.2835052 0.0405452 0.0317422 0.0867553 0.2107059 -0.0522142 0.0440328 -0.0450978 0.3801525 unknown
polarizability: 166.1208363|-0.6232491|117.9091222|-8.9380078|16.5048583|64.2811663 unknown
InChI: InChI=1S/C7H7N5O2/c8-7-10-5-4(6(14)11-7)12(1-2-13)3-9-5/h2-3,10H,1,8H2
charge 0 multiplicity 1
21 atoms
O  -0.021791 2.34943 0.76312
O  -3.68022 -0.285034 -1.293576
N  -1.333908 -0.442471 0.382023
N  2.085195 -1.084992 -0.296931
N  -0.103812 -2.279927 -0.205243
N  2.020754 1.287063 0.211905
N  4.041919 0.253551 -0.329857
C  -0.001446 -0.011179 0.260853
C  0.709807 -1.163226 -0.095498
C  -2.449308 0.442819 0.722961
C  -1.343451 -1.800424 0.087018
C  0.623302 1.296052 0.438276
C  2.678477 0.175126 -0.128207
C  -3.600795 0.434011 -0.273807
H  -2.028562 1.472017 0.799355
H  -2.86277 0.20145 1.724227
H  -2.250717 -2.396889 0.073162
H  2.608224 -1.924105 -0.553098
H  -4.413123 1.153905 0.000659
H  4.615911 -0.534223 -0.616953
H  4.461012 1.172346 -0.207787
