program: Gaussian 09
title: 000114861
version: EM64L-G09RevD.01
frameworkgroup: C1[X(C5H12ClN2O2P)]
method: RPBEPBE
basis: SDD
operation: Freq
keyword: #p
keyword: freq=noraman
keyword: PBEPBE/SDD
title: #p freq=noraman PBEPBE/SDD
converged: NO YES NO NO
title: Mulliken charges:
elementType: Cl P O O N N C C C C C H H H H H H H H H H H H
charge: -0.064568 1.344154 -0.468987 -0.585231 -0.715494 -0.730991 -0.366023 -0.363350 -0.286285 -0.263712 -0.547534 0.233120 0.205968 0.223926 0.234109 0.239634 0.197815 0.344799 0.335781 0.262441 0.250045 0.265568 0.254815
chargesum: 0.00000
title: Mulliken charges with hydrogens summed into heavy atoms:
elementType: Cl P O O N N C C C C C
charge: -0.064568 1.344154 -0.468987 -0.585231 -0.370695 -0.395210 0.073065 0.094685 0.151164 0.248774 -0.027151
polarizability: 1.26410548e+02 -3.85418464e-01 1.00049716e+02 6.44289926e+00 -2.41322020e+00 8.30960699e+01
1716.lowfreq: -25.4722 -5.4659 -0.0006 0.0026 0.0030 9.0363 31.9233 39.0534 64.5108
frequency: 31.7516 38.2597 64.2158 112.4103 118.1237 171.6596 211.2018 232.3314 264.4855 278.3030 320.6729 362.5622 398.6329 411.1175 436.7326 453.6991 523.1393 545.3693 596.5134 677.3449 743.1576 773.7130 803.4321 820.7160 877.4036 903.2751 946.8659 1016.4170 1037.8914 1052.1042 1056.4861 1087.2826 1099.8309 1112.2433 1152.4024 1191.0580 1216.2141 1250.3695 1267.2320 1285.5980 1341.5366 1347.2460 1353.4648 1359.0272 1370.6957 1398.1288 1436.7849 1450.0931 1455.3428 1470.1710 1474.9936 2976.1331 2988.8389 2993.9938 3001.3798 3054.6775 3058.8225 3070.7588 3077.3203 3087.8977 3144.0167 3527.0461 3556.9223
redmass: 3.8065 3.5441 3.1433 4.4438 3.1303 3.3879 5.2262 3.5487 9.4805 3.9173 2.1625 2.0232 4.6969 5.1567 2.7280 4.3062 1.4282 1.8695 6.4434 6.0558 2.7132 1.6324 2.2067 3.1615 1.7511 2.6053 2.4509 1.3604 2.7163 5.7668 5.6585 2.7112 3.2408 2.6723 1.2176 1.1955 1.2517 1.1685 1.1828 1.1352 1.3570 1.1956 1.2566 1.2463 1.2400 1.2673 1.0933 1.0923 1.0819 1.0822 1.0778 1.0659 1.0634 1.0624 1.0637 1.0577 1.0990 1.1019 1.1001 1.1003 1.1117 1.0757 1.0766
irintensity: 3.3634 0.8445 1.5107 1.2359 0.4549 4.2122 13.6445 2.6920 1.5547 11.4139 0.2918 86.7376 61.3770 3.6815 50.3138 4.5288 83.4893 17.8417 58.7929 77.4822 51.8359 80.5056 63.3090 104.6742 15.7339 34.3510 16.0189 13.9240 75.4083 56.2950 49.7781 57.3946 73.3968 68.2240 13.4431 15.9807 7.8472 4.0715 3.5224 11.6108 4.8801 5.9654 9.0981 10.9839 34.3442 30.1047 11.7255 4.2032 4.6843 6.0009 16.3195 44.8848 33.7178 36.9564 24.6170 22.9334 25.4682 39.2603 3.5756 27.6249 20.6513 18.6035 39.3677
temp: 298.150 k
press: 1.00000 atm
elementType: 17 15 8 8 7 7 6 6 6 6 6 1 1 1 1 1 1 1 1 1 1 1 1
symmnumber: 1
zpe: 478132.5 jmol-1
zpe.correction: 0.182111 hartree
zpe.thermalcorrener: 0.194907 hartree
zpe.thermalcorrenthalpy: 0.195851 hartree
zpe.thermalcorrgfe: 0.141282 hartree
zpe.sumelectzpe: -1258.051076 hartree
zpe.sumelectthermal: -1258.038281 hartree
zpe.sumelectthermalent: -1258.037336 hartree
zpe.sumelectthermalfe: -1258.091906 hartree
dipole: 2.7961 -4.5843 4.1698
dipole: 6.7986
quadrupole: -82.8933 -86.1548 -81.6874
quadrupole: -9.6175 2.7629 5.8304
quadrupole: 0.6852 -2.5763 1.8911 -9.6175 2.7629 5.8304
hfenergy: -1258.2331875 hartree
pointgroup: C01 [X(C5H12Cl1N2O2P1)]
dipole: -1.2624771 -1.5768043 -1.7533728 debye
dipolederiv: -0.6833288 0.1688309 -0.0976556 0.1271077 -0.2262556 0.0106796 -0.1955493 0.0559409 -0.2201548 2.4126708 0.1352082 0.053687 0.0758972 1.8503929 0.0674365 -0.3830897 -0.0942452 1.5084289 -0.7217051 -0.1836512 -0.0132175 -0.2431339 -1.1561008 0.1484351 0.0605136 0.0980102 -0.5087949 -0.7476856 0.027782 -0.0123773 0.0143012 -0.7585432 -0.0621344 0.0938528 -0.0570732 -0.5854219 -0.7980718 -0.2051121 -0.0655459 -0.2373156 -0.8258457 -0.0263468 -0.1648476 0.0731664 -0.8820998 -1.3790245 0.1153207 0.0387666 0.2866932 -0.7799133 -0.0964733 0.1191677 -0.0827871 -0.4745109 -0.0277918 -0.0450153 -0.0639533 -0.0718725 -0.0307861 0.0388028 -0.0577057 0.0592485 -0.0323091 0.1803047 0.0155333 -0.0904479 0.2253084 0.5568571 0.1171775 -0.0495103 0.002572 0.2629635 0.4324197 0.1307732 -0.0092102 0.1570745 0.6441335 -0.0314219 0.0526621 0.2306291 0.1844242 0.5731692 -0.0184744 0.0225125 -0.1974869 0.284739 -0.0978506 0.2237179 -0.0360702 0.0786748 0.7807735 -0.1483271 0.1609108 -0.0839395 0.1360136 -0.0409357 0.2453921 -0.0809946 0.2970531 -0.0528109 0.0518513 0.0590948 0.116888 0.0622327 -0.0378695 0.0758618 -0.0160481 -0.0139416 0.0602226 -0.0702391 -0.0172941 -0.1037976 -0.1541834 -0.034177 -0.0356601 -0.0611713 0.0703971 -0.0153792 0.087278 0.1380428 0.0208652 -0.0514986 -0.0661645 0.0823068 -0.03794 -0.0062853 -0.0900979 -0.0222009 -0.1384089 -0.013791 0.0369202 0.0064679 -0.1136757 0.0047683 0.004813 0.062293 -0.0492412 0.0087421 -0.0324215 -0.0475245 0.0959675 -0.0018912 0.0951818 -0.05968 -0.0919259 0.0795156 0.0534973 0.0489533 -0.0408266 -0.0387988 0.0812122 -0.1351462 0.0001932 0.1270163 0.0306145 -0.0570237 -0.0543704 0.1541282 -0.0886113 -0.0267847 -0.1044759 0.2901071 0.0795954 0.0380394 0.0284366 0.0454151 0.2842283 0.0448682 -0.0158641 0.0456134 0.1200214 0.0889699 0.0226158 0.0477293 0.0241588 0.0822021 -0.0008641 0.0159429 -0.0108663 -0.0352932 -0.1247354 -0.0785224 0.0008062 -0.0766333 -0.0539962 0.0351033 0.0104504 0.0364058 0.0813446 -0.0505275 -0.1039574 -0.0138756 -0.0568319 -0.0423509 0.0385819 -0.0140868 0.0442937 0.0491859 -0.0143506 0.0213785 -0.033216 0.0289314 0.0759772 0.0181276 -0.0024151 -0.0290118 -0.1291152 unknown
polarizability: 124.8393518|-3.9807774|100.5380224|9.3518818|1.4198364|84.1789596 unknown
InChI: InChI=1S/C5H12ClN2O2P/c6-2-4-8-11(9)7-3-1-5-10-11/h7-8H,1-5H2
charge 0 multiplicity 1
23 atoms
Cl 4.41289 -1.064985 0.381417
P  -0.636122 1.150512 0.104324
O  -0.809466 -0.079081 1.346958
O  -0.670988 2.612583 0.722508
N  -1.873665 0.814361 -1.063592
N  0.788199 0.586711 -0.728454
C  -2.496518 -1.387397 0.012488
C  -2.293828 -0.594322 -1.304502
C  -1.209847 -1.431665 0.860834
C  2.088493 0.448968 -0.039215
C  2.720425 -0.890339 -0.44256
H  -3.309447 -0.930026 0.606611
H  -2.794205 -2.426782 -0.22966
H  -1.52696 -1.100125 -1.923153
H  -3.227091 -0.570611 -1.893661
H  -1.35044 -2.013019 1.786353
H  -0.376938 -1.870086 0.272845
H  -2.587314 1.540904 -1.15477
H  0.821369 0.815415 -1.726472
H  1.917273 0.464701 1.051041
H  2.775951 1.28256 -0.27858
H  2.120341 -1.745789 -0.100781
H  2.911689 -0.956889 -1.524882
