program: Gaussian 09
title: 000114813
version: EM64L-G09RevD.01
frameworkgroup: C1[X(C16H20N2O6)]
method: RPBEPBE
basis: SDD
operation: Freq
keyword: #p
keyword: freq=noraman
keyword: PBEPBE/SDD
title: #p freq=noraman PBEPBE/SDD
converged: YES YES NO NO
title: Mulliken charges:
elementType: O O O O O O N N C C C C C C C C C C C C C C C C H H H H H H H H H H H H H H H H H H H H
charge: -0.149147 -0.149050 -0.158312 -0.205075 -0.158362 -0.205114 -0.290772 -0.290744 -0.376876 -0.376832 -0.371665 -0.371656 -0.517052 -0.517016 0.239658 0.239476 -0.513577 -0.513093 -0.513602 -0.513048 0.197346 0.204180 0.197278 0.204166 0.199351 0.194070 0.199353 0.194065 0.220123 0.218711 0.220124 0.218707 0.244335 0.297084 0.244359 0.297125 0.269281 0.271089 0.271602 0.268729 0.269266 0.271142 0.271594 0.268776
chargesum: 0.00000
title: Mulliken charges with hydrogens summed into heavy atoms:
elementType: O O O O O O N N C C C C C C C C C C C C C C C C
charge: -0.149147 -0.149050 -0.158312 -0.205075 -0.158362 -0.205114 -0.290772 -0.290744 0.016545 0.016587 0.067170 0.067175 0.024367 0.024467 0.239658 0.239476 0.026793 0.027238 0.026807 0.027323 0.197346 0.204180 0.197278 0.204166
polarizability: 2.61824646e+02 8.07997119e+00 1.89521871e+02 -2.86747180e-05 -5.02942739e-03 1.50083108e+02
1716.lowfreq: -0.0009 0.0008 0.0010 3.2837 4.5404 11.6771 13.4092 14.1785 23.9625
frequency: 13.3319 14.1633 23.9012 31.7550 42.4402 48.5627 59.7812 70.9729 72.9942 80.4618 81.6747 85.4260 95.3280 116.3354 136.3839 143.6567 148.7517 188.8500 192.8084 214.4804 252.8947 275.6010 318.2816 364.7755 374.7359 443.2991 446.4596 461.2589 461.2883 508.8474 509.5060 532.4580 532.6061 564.4184 566.1778 587.9376 589.2878 608.3117 608.7911 649.3148 649.5231 722.8382 735.8898 738.2164 741.5866 789.8287 822.1541 822.8191 863.6029 901.1551 908.6618 960.4369 977.3496 986.4515 1007.9677 1007.9951 1020.6145 1026.3103 1034.5342 1037.7857 1060.9052 1076.9408 1078.3851 1086.1467 1099.8387 1104.8237 1117.6638 1136.3257 1142.6972 1144.5657 1145.0304 1208.7800 1209.3025 1212.0822 1222.5458 1223.8464 1228.1836 1256.2990 1278.1998 1281.2856 1284.1038 1284.4324 1295.0791 1295.1018 1296.6170 1297.7799 1320.1228 1354.5146 1367.3842 1369.3900 1433.2768 1433.5861 1439.0527 1439.0865 1454.6530 1454.6898 1464.3368 1464.9078 1475.0219 1486.0424 1628.0809 1628.3652 1664.6624 1664.8506 1717.3727 1717.5200 2954.5381 2961.2949 2968.8239 2968.9803 2993.0121 2993.0591 2994.6304 3012.8065 3016.6087 3022.1689 3026.6343 3026.7180 3035.3668 3035.5229 3055.0383 3061.1633 3080.9028 3081.0321 3097.9980 3098.0577
redmass: 9.0353 5.4119 5.4474 6.2758 1.9090 5.2323 5.2084 2.0925 1.9423 3.9067 3.0028 3.1111 3.8045 7.2413 2.2144 2.1530 6.1485 6.3067 6.5513 7.6134 8.3334 5.8093 6.4548 7.1457 8.5477 6.4921 6.8536 4.3074 4.0393 2.5411 2.5611 3.4718 3.4595 4.2639 4.0995 2.8531 2.7775 6.0182 5.6460 6.2211 6.2091 1.0828 1.2222 6.1766 5.9551 1.4043 1.5229 1.5378 1.5383 6.1979 5.1462 1.5963 5.5821 3.5230 2.2006 2.2067 4.7316 3.1965 2.3649 2.6442 3.7866 3.3993 2.7240 2.4482 1.8960 4.2656 1.8131 5.3733 2.0059 1.2732 1.5588 1.3615 1.2807 1.3984 2.3596 3.1460 1.4890 1.2557 1.3998 1.1293 1.7010 1.8985 1.4938 1.4964 1.0909 1.1173 1.4930 1.5838 1.7154 1.6450 1.0913 1.0904 1.0708 1.0708 1.0910 1.0910 1.0658 1.0827 1.0926 1.0997 11.0040 10.9952 11.0293 11.0206 12.3623 12.3618 1.0593 1.0596 1.0624 1.0625 1.0917 1.0606 1.0658 1.0972 1.0953 1.1008 1.0598 1.0597 1.0647 1.0646 1.1035 1.1033 1.1021 1.1020 1.1011 1.1011
irintensity: 0.8263 1.6924 2.0575 0.5225 0.2085 10.5806 0.0160 1.6802 0.0683 6.9319 0.4493 0.8000 11.0330 0.4022 0.9970 0.3355 1.0073 2.7142 0.2956 1.5408 6.8358 35.8199 0.1181 0.0040 1.7531 1.8509 0.6711 0.1090 2.0600 0.2140 1.3065 0.4095 0.0971 7.8230 5.7115 7.5507 0.1586 0.4407 48.0161 44.2693 50.3463 13.1571 3.1170 0.5348 46.0543 0.8503 12.8408 22.8318 4.8974 11.1228 23.5348 0.2477 6.5302 4.1741 13.2662 1.3451 17.4579 0.5646 44.6251 1.4717 16.5087 203.1691 4.9222 10.0153 92.7017 9.2909 52.5128 455.2364 51.6882 15.1256 46.8286 142.0192 6.2060 4.0809 351.9926 3.9799 401.9419 0.0857 0.1482 9.0597 200.7415 3.7710 0.0744 0.0902 0.0457 3.4308 164.3105 0.0045 0.0296 53.9469 0.4935 54.8724 0.6224 0.7231 39.8918 16.9283 0.0419 2.7549 0.0079 23.6241 167.6235 280.8375 106.3037 581.0942 152.0075 31.6420 0.0503 41.9621 12.1655 6.2879 8.6721 0.2156 45.4391 4.2105 9.5032 15.4429 11.0281 11.0627 0.6914 0.6965 1.4723 101.4568 0.5083 0.5376 5.6928 5.8744
temp: 298.150 k
press: 1.00000 atm
elementType: 8 8 8 8 8 8 7 7 6 6 6 6 6 6 6 6 6 6 6 6 6 6 6 6 1 1 1 1 1 1 1 1 1 1 1 1 1 1 1 1 1 1 1 1
symmnumber: 1
zpe: 901997.9 jmol-1
zpe.correction: 0.343553 hartree
zpe.thermalcorrener: 0.368330 hartree
zpe.thermalcorrenthalpy: 0.369274 hartree
zpe.thermalcorrgfe: 0.282596 hartree
zpe.sumelectzpe: -1180.796251 hartree
zpe.sumelectthermal: -1180.771473 hartree
zpe.sumelectthermalent: -1180.770529 hartree
zpe.sumelectthermalfe: -1180.857208 hartree
dipole: 0.0012 -0.0020 -0.2259
dipole: 0.2259
quadrupole: -72.9326 -164.8118 -147.7873
quadrupole: 45.5895 0.0051 0.0061
quadrupole: 55.5780 -36.3012 -19.2767 45.5895 0.0051 0.0061
hfenergy: -1181.1398033 hartree
pointgroup: C01 [X(C16H20N2O6)]
dipole: 0.0004921 -0.0011028 -0.0888822 debye
polarizability: 261.6792518|8.7049933|189.6666685|-0.0189762|-0.1534634|150.0837042 unknown
InChI: InChI=1S/C16H20N2O6/c19-11(17-13(21)7-8-14(17)22)5-3-1-2-4-6-12(20)18-15(23)9-10-16(18)24/h1-10H2
charge 0 multiplicity 1
44 atoms
O  4.38233 -1.984736 0.017437
O  -4.38328 1.984827 0.001169
O  6.805446 -1.56025 1.590823
O  5.339822 1.766502 -1.427422
O  -6.807178 1.571477 1.576793
O  -5.338105 -1.777346 -1.415226
N  5.742784 -0.074036 0.04346
N  -5.742988 0.073819 0.041644
C  0.675499 0.374757 -0.026011
C  -0.675727 -0.374232 -0.023051
C  1.887245 -0.582319 -0.015395
C  -1.887561 0.582778 -0.019279
C  3.224338 0.181471 -0.024897
C  -3.22451 -0.181305 -0.022537
C  4.428553 -0.739615 0.001442
C  -4.429001 0.739606 -0.004628
C  8.086535 0.259027 0.482103
C  7.583862 1.392534 -0.432898
C  -8.086354 -0.258226 0.483055
C  -7.583562 -1.395934 -0.426639
C  6.860227 -0.60318 0.799769
C  6.102449 1.103361 -0.689452
C  -6.860912 0.607775 0.79375
C  -6.101779 -1.108733 -0.683292
H  0.727025 1.032055 -0.918766
H  0.722399 1.045537 0.857374
H  -0.727452 -1.03816 -0.910874
H  -0.722356 -1.038444 0.865304
H  1.841453 -1.240116 0.873689
H  1.845094 -1.254246 -0.894097
H  -1.841585 1.247317 0.864761
H  -1.845808 1.248001 -0.903094
H  3.299325 0.865577 0.846573
H  3.310531 0.84175 -0.910865
H  -3.299647 -0.857801 0.854833
H  -3.310304 -0.849189 -0.902845
H  8.526925 0.613903 1.428561
H  8.842294 -0.382609 -0.003893
H  8.1051 1.444551 -1.403493
H  7.668112 2.391505 0.029423
H  -8.523744 -0.608937 1.432493
H  -8.844578 0.379324 -0.004398
H  -8.103832 -1.451166 -1.397611
H  -7.669182 -2.39307 0.039306
