program: Gaussian 09
title: 000114812
version: EM64L-G09RevD.01
frameworkgroup: C1[X(C8H12N2O3S)]
method: RPBEPBE
basis: SDD
operation: Freq
keyword: #p
keyword: freq=noraman
keyword: PBEPBE/SDD
title: #p freq=noraman PBEPBE/SDD
converged: YES YES NO NO
title: Mulliken charges:
elementType: S O O O N N C C C C C C C C H H H H H H H H H H H H
charge: 0.159531 -0.436846 -0.247301 -0.284723 -0.389051 -0.095439 -0.104986 -0.697836 -0.646582 0.177850 0.261284 -0.417461 -0.774173 -0.002004 0.298136 0.320880 0.278300 0.353924 0.302627 0.279554 0.268275 0.258234 0.252579 0.253855 0.217494 0.413878
chargesum: 0.00000
title: Mulliken charges with hydrogens summed into heavy atoms:
elementType: S O O O N N C C C C C C C C
charge: 0.159531 -0.022968 -0.247301 -0.284723 -0.035127 -0.095439 0.193149 -0.098656 -0.064401 0.177850 0.261284 0.109048 -0.050243 -0.002004
polarizability: 1.51495821e+02 -1.73095890e-01 1.08732263e+02 1.58462593e+00 -7.36247326e+00 1.00626612e+02
1716.lowfreq: -13.0798 -7.1504 0.0008 0.0012 0.0019 9.9719 42.2773 63.3061 69.4157
frequency: 42.2097 63.2942 69.3756 78.3515 96.7082 102.6475 121.6306 140.6998 146.2237 176.2939 188.0927 216.5665 264.8497 292.8002 347.2752 355.9911 373.8321 459.2717 507.8476 540.3691 553.3151 585.3506 602.3381 615.3258 623.4736 630.6386 702.5234 750.7361 802.8445 830.2264 887.4272 910.9615 942.5014 968.7847 984.8463 990.6170 1024.3369 1044.3109 1115.2730 1147.9895 1164.3182 1177.8548 1199.8318 1224.7546 1245.5872 1288.9806 1305.5412 1323.3504 1324.4169 1356.0575 1387.7800 1427.3752 1441.7260 1448.5067 1450.3721 1461.8653 1481.1197 1604.9582 1647.6808 2211.4438 2986.1105 2997.7601 2998.4493 3035.5556 3051.7855 3055.5856 3098.1904 3103.8058 3119.5124 3132.4437 3243.7597 3550.7879
redmass: 4.5410 3.2793 2.5903 1.9434 9.0092 4.7893 7.2589 5.4749 5.9926 5.2108 5.5708 2.9756 3.6069 6.9861 3.2242 3.7312 2.9863 4.7751 3.7999 4.7627 4.2200 2.1576 3.7523 3.2325 1.8921 3.5055 1.6656 2.7807 2.2496 3.0161 2.6514 2.3084 4.1995 1.9858 2.4941 1.5568 3.1157 1.6552 1.7519 2.8480 1.1226 1.4194 1.1511 1.2935 1.4967 1.3484 1.3616 1.3212 1.3256 2.0646 1.2310 1.0883 1.0886 1.0838 1.0460 1.2112 1.8430 6.5021 8.6132 12.4037 1.0815 1.0593 1.0358 1.0601 1.0591 1.0977 1.0980 1.1010 1.1089 1.1071 1.0663 1.0785
irintensity: 0.2467 2.5334 12.3073 2.9671 3.2125 1.9008 3.6844 21.2644 4.4932 15.7011 1.5967 1.5519 12.7535 1.0492 2.7078 4.2395 0.5672 6.9309 22.2582 37.9309 10.7766 14.4869 14.0552 14.5491 3.4126 21.8355 196.6015 151.3522 0.5164 13.5888 13.5434 5.4998 15.2656 5.6460 31.2635 2.9970 2.1071 14.4524 64.6273 125.5332 5.6077 21.2182 0.8743 9.5679 22.2111 57.1638 4.9831 10.1315 0.2340 21.6062 65.5822 32.5227 27.8351 18.7477 15.3029 151.6776 247.4047 158.2898 178.1822 23.0380 9.4918 8.7238 9.0687 22.7705 10.0073 4.1381 8.6923 18.6171 2.8747 0.8076 322.1534 61.2211
temp: 298.150 k
press: 1.00000 atm
elementType: 16 8 8 8 7 7 6 6 6 6 6 6 6 6 1 1 1 1 1 1 1 1 1 1 1 1
symmnumber: 1
zpe: 519451.0 jmol-1
zpe.correction: 0.197848 hartree
zpe.thermalcorrener: 0.213597 hartree
zpe.thermalcorrenthalpy: 0.214542 hartree
zpe.thermalcorrgfe: 0.153986 hartree
zpe.sumelectzpe: -1044.217197 hartree
zpe.sumelectthermal: -1044.201448 hartree
zpe.sumelectthermalent: -1044.200504 hartree
zpe.sumelectthermalfe: -1044.261060 hartree
dipole: 3.1773 -1.1129 -2.0109
dipole: 3.9214
quadrupole: -84.6765 -94.4435 -91.5483
quadrupole: -16.4954 5.7238 -1.7649
quadrupole: 5.5462 -4.2207 -1.3255 -16.4954 5.7238 -1.7649
hfenergy: -1044.4150455 hartree
pointgroup: C01 [X(C8H12N2O3S1)]
dipole: 1.37579 0.6421347 0.2739565 debye
dipolederiv: -0.3394668 -0.082755 -0.0210609 -0.0423912 -0.1101659 0.1043492 -0.0546809 0.1022086 -0.1227576 -0.5944761 -0.0091139 -0.1119063 0.0459606 -0.4934895 0.2229572 -0.1002097 0.1050872 -1.0948423 -0.6631516 0.2331538 0.2598794 0.1833161 -0.5918679 -0.1797906 0.0811837 -0.082943 -0.6861103 -0.8458433 0.1503339 -0.0448297 0.1566289 -0.4345228 -0.0227889 -0.3158356 0.0829958 -0.8356864 -1.253368 0.2902328 0.0776321 0.3443574 -0.579642 0.0218103 0.0438712 0.0556785 -0.432369 -0.4011727 -0.0550252 -0.0159076 0.0301116 -0.3514693 0.1494015 -0.1152444 0.1066391 -0.3761801 0.2316725 0.0787368 -0.194095 -0.0148588 0.1254382 0.0723355 -0.4974945 0.168662 0.2251744 0.2251255 0.2256946 0.0524949 0.2868162 0.0807319 0.0121264 0.1629313 -0.0602283 0.0500491 0.4109346 -0.137291 0.0158741 -0.1292489 0.0088821 -0.0445722 -0.0411654 -0.1059119 0.1016192 0.7406287 -0.4986041 -0.0749557 -0.3768471 0.6764338 0.0114331 0.0576347 -0.0484522 1.341558 1.5528564 -0.5251854 0.0059803 -0.6263771 0.437053 0.0826102 0.2290397 -0.0142686 1.0035788 0.0547004 0.008391 -0.03899 0.0234922 0.0973312 0.0949843 0.0693171 0.081 0.0504963 -0.1544197 0.0914902 0.2003564 0.1098656 -0.0440451 -0.1380518 0.1995821 -0.1157282 -0.2151811 -0.0122964 0.0267913 -0.0579908 -0.085513 0.1825528 -0.2003581 0.0221262 -0.1487988 0.1765655 0.0193919 -0.0765457 -0.0400008 -0.0488592 0.0236863 -0.0271178 0.0901398 -0.0569161 0.0303535 0.0326369 0.0223917 -0.070881 -0.0109704 0.013416 0.0104968 -0.0712445 0.0131006 0.1035457 -0.0279276 -0.0247252 0.0702626 -0.0671662 0.051328 -0.0824334 0.0601341 -0.0593334 -0.0309461 0.2961442 0.0078902 -0.0258294 0.0133635 0.3082731 -0.0218929 0.0351769 -0.0416686 0.1620595 0.0121345 0.0225618 -0.0425982 0.0431025 0.0159409 -0.0739882 -0.0218768 -0.0476609 0.0723291 -0.0800082 0.0065728 0.0665637 -0.0152577 0.025946 0.0874432 0.0856641 0.0839955 -0.0379971 0.148488 -0.0049786 0.0044256 -0.0647146 -0.006548 -0.0351767 -0.0306802 -0.0325445 0.032451 -0.0622781 0.0514541 0.0352394 0.0969075 0.0798331 0.0063898 0.0247925 0.0295207 0.062243 0.1275597 0.0103417 -0.0059424 0.045189 -0.0797413 -0.0070578 0.0128217 0.0347203 0.0773852 -0.0536433 -0.0690185 0.0235167 -0.0968794 0.0918074 0.016012 0.0054945 -0.02227 0.0833957 0.0240271 0.0425737 -0.1238838 0.0465999 0.0914761 0.0478444 -0.0528664 0.014065 -0.0854156 0.6117514 0.2146321 0.0566462 0.1533723 0.3813622 -0.1069654 0.121389 -0.0409485 0.3446815 unknown
polarizability: 149.7132781|-8.2691105|100.1094709|-5.3427437|-5.2434048|111.0319467 unknown
InChI: InChI=1S/C8H12N2O3S/c1-6(11)10-7(8(12)13)5-14-4-2-3-9/h7,10,12H,2,4-5H2,1H3
charge 0 multiplicity 1
26 atoms
S  0.863567 1.783987 -0.55105
O  -0.011217 -1.36752 1.291387
O  0.698789 -1.797596 -0.884046
O  -3.655648 1.021305 -0.747625
N  -1.922902 0.280985 0.599593
N  2.702496 -1.058936 1.58109
C  -1.18165 -0.269794 -0.536267
C  -0.530213 0.829062 -1.423831
C  2.414331 0.954855 -1.283026
C  -0.086341 -1.238083 -0.084367
C  -3.150602 0.890698 0.412942
C  3.503482 0.754338 -0.194245
C  -3.845056 1.391722 1.673052
C  3.098907 -0.237823 0.814839
H  -1.893235 -0.811798 -1.193053
H  -1.299952 1.56914 -1.689215
H  -0.116661 0.383502 -2.342482
H  -1.522275 0.13933 1.529134
H  2.113374 -0.013618 -1.711604
H  2.815707 1.610348 -2.072648
H  3.728272 1.712579 0.31064
H  4.4403 0.41048 -0.674942
H  -3.990393 2.483271 1.596674
H  -4.846899 0.93359 1.737366
H  -3.288057 1.169373 2.599088
H  0.898777 -1.701696 1.575494
