program: Gaussian 09
title: 000114811
version: EM64L-G09RevD.01
frameworkgroup: C1[X(C12H14Cl2FNO4S)]
method: RPBEPBE
basis: SDD
operation: Freq
keyword: #p
keyword: freq=noraman
keyword: PBEPBE/SDD
title: #p freq=noraman PBEPBE/SDD
converged: YES YES NO NO
title: Mulliken charges:
elementType: Cl Cl S F O O O O N C C C C C C C C C C C C H H H H H H H H H H H H H H
charge: 0.025336 0.035463 0.922203 -0.239654 -0.446865 -0.546461 -0.549111 -0.216282 -0.352195 -0.151706 -0.225377 0.462224 -0.262576 -0.409195 -0.354760 -0.099656 -0.263937 -0.250927 0.352230 -0.742151 -0.707253 0.291272 0.239688 0.234568 0.232490 0.338884 0.265866 0.290979 0.293562 0.289378 0.353703 0.264626 0.266170 0.295983 0.363482
chargesum: 0.00000
title: Mulliken charges with hydrogens summed into heavy atoms:
elementType: Cl Cl S F O O O O N C C C C C C C C C C C C
charge: 0.025336 0.035463 0.922203 -0.239654 -0.093162 -0.546461 -0.549111 -0.216282 -0.013311 0.139566 0.014311 0.462224 0.204481 -0.143328 -0.063781 -0.099656 0.029625 0.038452 0.352230 0.084627 -0.343771
polarizability: 2.66994108e+02 2.49174053e+00 1.78588831e+02 1.13259197e+01 -1.30612801e+01 1.45342247e+02
1716.lowfreq: -8.2542 -0.0014 -0.0013 -0.0007 1.8579 2.8736 15.3434 18.2389 22.8014
frequency: 15.3324 18.1656 22.7890 28.7766 43.5787 52.0796 66.5850 67.3200 97.7008 107.6879 123.6880 148.5597 154.3294 167.1420 199.7675 205.0742 228.6403 236.4379 242.6108 247.2423 282.3606 323.3048 338.3254 352.8153 364.4431 384.3547 402.7021 408.4757 421.0654 434.4462 491.2968 531.3448 580.8965 588.7224 618.2793 620.5811 630.3924 662.8858 679.1782 706.7005 729.9674 748.3171 787.3179 806.8305 853.9695 858.7114 867.0507 885.1793 886.8440 967.0791 971.5747 973.7944 992.4167 998.8181 1003.8724 1005.4495 1012.3132 1053.6788 1086.3565 1113.6045 1123.1061 1154.1975 1180.6454 1187.3200 1192.9882 1206.9153 1220.1074 1234.3821 1261.0657 1294.8005 1300.8309 1311.2359 1329.4285 1366.0321 1369.9659 1386.7185 1406.6201 1409.0831 1421.3051 1465.0841 1472.5275 1492.8399 1596.0032 1596.6207 1622.4175 2967.3281 3028.7922 3035.9247 3045.0785 3117.1601 3129.8483 3149.2323 3156.1343 3167.0950 3174.4982 3178.6253 3182.8459 3499.2806 3536.4772
redmass: 10.1047 9.1262 8.4178 9.2020 8.1153 4.6551 10.3340 8.1001 8.4012 5.9396 5.2063 7.0702 1.1232 6.4737 6.7509 7.1892 5.9649 7.5018 5.9262 7.4343 5.3410 6.1709 6.6928 5.7884 3.6119 10.4637 1.3046 2.9079 4.8171 3.5352 4.8803 3.5709 6.4217 8.3066 4.2103 4.6361 5.2783 5.3223 1.6745 3.9084 3.7942 6.9544 11.5683 3.5814 2.0496 2.0360 1.5216 2.6299 3.0216 1.4069 1.8180 2.1943 1.4031 4.5584 3.4147 2.2745 3.9769 2.4389 2.2469 1.3847 2.3847 1.5866 1.1534 1.0792 1.2783 1.3203 1.3693 1.6850 1.4448 1.2750 1.1397 1.5808 1.2337 1.5713 1.6001 4.7011 1.0526 2.3176 1.0574 1.0922 2.3965 1.8625 7.4407 6.0700 9.0609 1.0845 1.0246 1.0723 1.0683 1.1110 1.0896 1.0897 1.0957 1.0899 1.0957 1.1070 1.1079 1.0774 1.0658
irintensity: 1.5559 0.2455 1.7452 1.2162 3.7516 0.9807 4.0148 0.8524 2.6454 2.2662 5.2734 8.6676 0.4484 1.1912 22.2843 0.6324 1.5952 1.8294 3.5795 9.9575 22.6767 3.2422 7.4000 0.9028 14.2574 8.0252 130.4432 0.8400 57.2190 21.7822 4.4624 24.0773 22.7409 95.8969 11.0238 10.7791 3.3401 68.3520 92.6224 84.4400 1.7455 51.1045 67.0247 21.5451 41.9848 16.1015 25.1177 13.5289 29.3875 67.3704 6.7939 1.6004 4.3342 5.0375 44.0065 66.1746 19.1947 37.4134 3.3220 1.8017 15.3558 32.9096 3.1939 10.1852 11.0212 45.0607 7.9932 13.7332 2.3146 1.3594 3.9860 58.9346 9.1798 18.6927 8.4991 13.0609 10.4309 5.6645 15.9330 16.8369 30.0896 251.9204 0.8783 3.3287 224.1850 23.0782 1.4417 9.7420 24.9925 23.9877 3.5378 1.5748 5.3821 0.3841 0.7033 0.7762 1.3868 44.9212 20.4826
temp: 298.150 k
press: 1.00000 atm
elementType: 17 17 16 9 8 8 8 8 7 6 6 6 6 6 6 6 6 6 6 6 6 1 1 1 1 1 1 1 1 1 1 1 1 1 1
symmnumber: 1
zpe: 651185.9 jmol-1
zpe.correction: 0.248024 hartree
zpe.thermalcorrener: 0.271188 hartree
zpe.thermalcorrenthalpy: 0.272133 hartree
zpe.thermalcorrgfe: 0.190569 hartree
zpe.sumelectzpe: -2237.589631 hartree
zpe.sumelectthermal: -2237.566467 hartree
zpe.sumelectthermalent: -2237.565522 hartree
zpe.sumelectthermalfe: -2237.647086 hartree
dipole: -4.6674 3.9267 3.6633
dipole: 7.1150
quadrupole: -179.7220 -153.0881 -145.0822
quadrupole: 11.9621 23.0116 4.2534
quadrupole: -20.4246 6.2094 14.2153 11.9621 23.0116 4.2534
hfenergy: -2237.8376549 hartree
pointgroup: C01[X(C12H14Cl2F1N1O4S1)]
dipole: 1.8849187 -1.9163122 0.7815008 debye
polarizability: 264.6728575|6.0894796|168.54235|-19.1144791|19.7330292|157.7099792 unknown
InChI: InChI=1S/C12H14Cl2FNO4S/c1-21(19,20)8-4-2-7(3-5-8)10(17)9(6-15)16-12(18)11(13)14/h2-5,9-11,16-17H,6H2,1H3
charge 0 multiplicity 1
35 atoms
Cl 6.0074 -1.208044 -0.922452
Cl 5.443397 1.818165 -0.84966
S  -5.250484 0.258196 0.442512
F  1.409176 -2.504019 -1.507155
O  1.272026 1.728401 -0.759819
O  -5.625809 1.718591 1.078303
O  -6.022227 -0.365586 -0.85972
O  3.66696 0.322665 1.81917
N  3.05191 -0.469566 -0.300127
C  1.615789 -0.607009 -0.002627
C  0.79761 0.357254 -0.938972
C  -0.687086 0.342508 -0.607063
C  1.190177 -2.069853 -0.113149
C  -1.558651 -0.541009 -1.292546
C  -1.199116 1.211565 0.389215
C  -3.392549 0.268114 0.043942
C  -2.933506 -0.585967 -0.970712
C  -2.571345 1.183099 0.722146
C  3.951516 0.00361 0.629285
C  -5.432396 -1.022663 1.857135
C  5.386124 0.215942 0.128213
H  1.476621 -0.273423 1.043519
H  0.947348 0.019245 -1.986541
H  0.118452 -2.210377 0.100282
H  1.81382 -2.723336 0.519881
H  3.40067 -0.855902 -1.184235
H  -1.167553 -1.185042 -2.089435
H  -0.524323 1.928243 0.866032
H  -3.635297 -1.228629 -1.512878
H  -3.001622 1.872654 1.456448
H  2.249322 1.762997 -0.929276
H  -5.087986 -1.988531 1.463157
H  -4.827629 -0.660537 2.699678
H  -6.506365 -1.029317 2.09026
H  6.080728 0.33176 0.966989
