program: Gaussian 09
title: 000015040
version: EM64L-G09RevD.01
frameworkgroup: C1[X(C10H12Cl5N2O2P)]
method: RPBEPBE
basis: SDD
operation: Freq
keyword: #p
keyword: freq=noraman
keyword: PBEPBE/SDD
title: #p freq=noraman PBEPBE/SDD
converged: YES YES NO NO
title: Mulliken charges:
elementType: Cl Cl Cl Cl Cl P O O N N C C C C C C C C C C H H H H H H H H H H H H
charge: 0.050952 0.030333 0.050868 0.054379 0.058443 1.357786 -0.504343 -0.585290 -0.504087 -0.472376 -0.571658 -0.561075 -0.573709 -0.564142 0.681989 -0.257758 -0.298356 -0.074344 -0.073472 -0.123080 0.221690 0.225047 0.277087 0.237489 0.228143 0.246393 0.275365 0.224075 0.229276 0.223032 0.256903 0.234442
chargesum: 0.00000
title: Mulliken charges with hydrogens summed into heavy atoms:
elementType: Cl Cl Cl Cl Cl P O O N N C C C C C C C C C C
charge: 0.050952 0.030333 0.050868 0.054379 0.058443 1.357786 -0.504343 -0.585290 -0.504087 -0.472376 0.152166 0.150950 0.155007 0.150234 0.681989 -0.257758 -0.298356 -0.074344 -0.073472 -0.123080
polarizability: 2.76237449e+02 -2.33830120e+00 2.33069613e+02 1.52445115e+01 -1.48496903e+00 1.19803569e+02
1716.lowfreq: -4.4500 -0.0029 -0.0029 -0.0025 5.2724 6.3808 29.1932 32.2344 40.1248
frequency: 29.1488 32.2045 40.1052 64.7760 70.8658 75.2592 93.2587 101.8268 107.3061 121.5399 130.7184 167.3979 168.4180 174.5148 184.5344 193.7757 202.2609 203.3142 206.6513 215.4912 235.4910 247.8858 297.1465 305.0755 306.2422 314.7158 318.2500 324.8740 331.4477 347.8473 355.6581 393.5428 412.7393 426.8802 472.6120 528.2683 584.4906 610.5199 615.4997 638.9341 658.9376 693.6900 728.4249 772.4795 817.6829 927.2519 961.5962 964.9365 1035.6271 1061.7100 1062.6643 1068.7992 1093.6144 1095.1312 1134.2706 1137.5991 1184.4029 1202.4832 1239.1227 1272.7096 1277.3834 1308.4022 1341.2059 1358.9748 1421.2773 1423.5795 1435.5563 1441.4276 1461.7095 1470.8585 1474.6438 1477.1295 1478.4438 1481.9501 1493.9592 1496.1588 1515.8380 1539.9551 2954.2152 2957.9916 2958.0548 2962.8685 3033.5227 3037.1723 3038.2724 3041.5668 3098.0400 3101.6454 3103.1787 3141.4713
redmass: 5.9608 8.1726 4.3394 4.5860 11.7106 14.5106 4.9682 3.3254 4.8274 2.4506 4.1380 1.1847 4.7850 1.5295 1.2990 1.3882 8.6902 21.9693 6.4154 32.7936 2.7865 4.0009 6.6746 7.5674 6.1525 9.3240 5.9744 11.2802 4.9553 4.2431 26.1379 4.9027 4.1483 4.7805 9.6763 8.1153 12.0788 12.9928 6.6883 12.1125 14.2359 6.6124 14.0097 12.0828 12.9150 11.6383 3.3426 2.7245 7.9592 1.4192 1.3955 10.8646 1.2143 1.2177 1.3477 1.3547 5.0640 5.7687 12.2345 2.2346 2.2036 12.0032 12.0054 12.0196 1.1244 1.1236 1.1404 1.1436 1.0431 1.0440 1.0469 1.0475 1.0476 1.0490 1.0602 1.0585 11.4743 11.6911 1.0379 1.0380 1.0368 1.0358 1.0990 1.1004 1.1005 1.1012 1.0983 1.0982 1.0984 1.0953
irintensity: 0.8447 0.3004 0.5478 1.0303 0.2397 0.7235 0.5673 3.6292 0.5429 2.2193 1.2486 0.1934 0.4481 0.4145 0.1134 0.4236 0.5418 0.1617 0.5437 0.0333 11.6877 8.3128 14.8945 9.1828 12.8590 1.7940 7.8106 1.3748 8.8265 6.4458 0.0063 12.8048 6.9022 24.4861 16.6070 57.1354 0.1060 10.8213 143.8145 3.9830 57.7574 69.1065 211.0538 2.0030 0.6768 140.8793 70.4581 209.3928 113.5275 13.8954 12.5268 9.0104 0.2327 0.3915 0.5285 0.5086 56.2921 40.7033 1.7296 15.8429 8.8256 95.2695 54.7359 439.9418 18.5361 13.4080 2.8893 2.0270 6.0534 3.6276 8.2437 19.2427 40.8814 31.0038 13.8545 2.4799 3.7304 17.6070 40.7791 158.2240 28.6289 81.5214 65.1294 23.9647 45.9640 10.9764 16.6276 1.9807 6.9189 3.7700
temp: 298.150 k
press: 1.00000 atm
elementType: 17 17 17 17 17 15 8 8 7 7 6 6 6 6 6 6 6 6 6 6 1 1 1 1 1 1 1 1 1 1 1 1
symmnumber: 1
zpe: 556808.3 jmol-1
zpe.correction: 0.212077 hartree
zpe.thermalcorrener: 0.236183 hartree
zpe.thermalcorrenthalpy: 0.237127 hartree
zpe.thermalcorrgfe: 0.156955 hartree
zpe.sumelectzpe: -3288.159580 hartree
zpe.sumelectthermal: -3288.135473 hartree
zpe.sumelectthermalent: -3288.134529 hartree
zpe.sumelectthermalfe: -3288.214702 hartree
dipole: -5.1510 1.4471 -1.7560
dipole: 5.6312
quadrupole: -139.2255 -155.0632 -164.1257
quadrupole: -2.4323 3.2142 6.8794
quadrupole: 13.5793 -2.2584 -11.3209 -2.4323 3.2142 6.8794
hfenergy: -3288.3716566 hartree
pointgroup: C01 [X(C10H12Cl5N2O2P1)]
dipole: -2.027029 0.8914522 -0.0694724 debye
polarizability: 276.6610122|-4.5563263|213.7520475|-6.5593546|43.9645511|138.6975719 unknown
InChI: InChI=1S/C10H12Cl5N2O2P/c1-16(2)20(18,17(3)4)19-10-8(14)6(12)5(11)7(13)9(10)15/h1-4H3
charge 0 multiplicity 1
32 atoms
Cl 0.110216 -2.361552 -1.63635
Cl 0.442158 2.848344 0.201653
Cl 3.656601 2.609749 0.341855
Cl 3.315913 -2.640116 -1.477486
Cl 5.090852 -0.145229 -0.494726
P  -2.031323 -0.189593 0.5593
O  -0.911775 0.362177 -0.797054
O  -1.296793 -1.292011 1.45066
N  -3.403473 -0.482425 -0.452085
N  -2.537433 1.16129 1.506138
C  -3.2950 -1.006079 -1.829009
C  -4.696928 -0.761392 0.212502
C  -1.943025 1.36355 2.843097
C  -3.21198 2.327222 0.907891
C  0.458173 0.218004 -0.678977
C  1.11064 -0.987305 -1.055132
C  1.262264 1.310141 -0.25564
C  2.668097 1.206475 -0.197661
C  2.516505 -1.102127 -0.997376
C  3.299877 -0.00488 -0.566471
H  -4.106633 -0.560537 -2.435174
H  -3.396012 -2.110316 -1.861552
H  -2.330211 -0.720583 -2.26847
H  -4.888146 -1.850841 0.294396
H  -5.512572 -0.303996 -0.37855
H  -4.711327 -0.323415 1.224012
H  -1.463498 0.428391 3.175407
H  -2.741788 1.630547 3.560632
H  -1.187307 2.174186 2.830143
H  -4.048905 2.642686 1.559961
H  -3.615672 2.062001 -0.08236
H  -2.512394 3.178536 0.791126
