program: Gaussian 09
title: 000114785
version: EM64L-G09RevD.01
frameworkgroup: C1[X(C16H17N3)]
method: RPBEPBE
basis: SDD
operation: Freq
keyword: #pfreq=noraman
keyword: PBEPBE/SDD
title: #p freq=noraman PBEPBE/SDD
converged: YES YES NO NO
title: Mulliken charges:
elementType: N N N C C C C C C C C C C C C C C C C H H H H H H H H H H H H H H H H H
charge: -0.174645 -0.111462 -0.140762 -0.456716 -0.456876 -0.383736 -0.382825 0.418597 -0.329356 -0.346568 -0.308226 -0.361997 0.143435 0.179873 -0.305234 -0.349802 -0.203680 -0.206525 -0.245612 0.227406 0.232745 0.227271 0.232779 0.236070 0.225139 0.235727 0.224855 0.235586 0.238219 0.271693 0.244772 0.271399 0.245442 0.222562 0.225073 0.225379
chargesum: 0.00000
title: Mulliken charges with hydrogens summed into heavy atoms:
elementType: N N N C C C C C C C C C C C C C C C C
charge: -0.174645 -0.111462 -0.140762 0.003435 0.003173 0.077473 0.077756 0.418597 -0.093769 -0.108348 -0.036533 -0.117225 0.143435 0.179873 -0.033835 -0.104360 0.018882 0.018548 -0.020233
polarizability: 5.36540636e+02 7.14477490e+00 1.80903036e+02 8.64831002e-04 -2.43447212e+00 9.11391117e+01
1716.lowfreq: -10.5627 -1.4930 -0.0006 -0.0003 0.0004 8.6807 24.6632 29.6618 54.6313
frequency: 24.4977 29.6533 54.5644 69.2252 96.7382 114.7248 144.5159 170.5739 181.8422 230.8059 240.9503 271.0168 273.1400 379.7394 380.1854 407.7875 431.5716 439.4978 499.0468 522.2945 545.0761 561.5398 574.4591 609.6779 631.4018 665.6007 693.3956 738.6025 752.3964 779.5618 806.8975 814.6261 831.4382 850.7611 864.5911 865.8357 897.1931 917.6348 925.6652 934.1777 959.5088 961.4573 981.4009 983.3669 984.4123 987.7667 988.4617 996.6314 1014.0519 1067.4616 1072.9975 1112.1522 1117.0686 1140.6457 1152.2261 1158.7907 1167.5832 1169.7104 1178.0015 1191.7368 1224.2867 1243.1468 1253.0787 1300.9398 1304.0674 1308.9816 1314.0538 1325.1163 1335.5439 1344.5120 1377.2562 1387.9774 1388.7538 1441.7791 1459.9509 1464.1595 1470.5914 1474.9496 1491.2219 1497.9292 1514.2853 1549.4405 1581.0081 1601.5942 1625.7956 2943.7131 2948.0711 3006.4551 3008.6542 3021.9291 3024.7045 3080.7394 3093.6499 3122.3580 3133.3894 3142.3284 3143.3961 3148.6407 3162.0901 3164.5880 3168.1697 3169.1732
redmass: 3.9751 4.0106 5.0212 4.2086 3.0459 3.9236 4.6334 3.1975 5.0341 5.0649 1.6525 4.7815 5.7181 5.5360 5.6998 2.9118 3.3864 4.5116 2.7776 5.7289 2.5805 6.8182 1.9031 6.4956 6.7749 5.9015 1.8670 3.5884 2.5869 1.8094 1.2887 5.7776 1.7487 1.2470 1.7395 1.7776 7.2052 2.7314 1.4106 1.4500 4.2410 1.3662 1.3835 1.3668 6.1065 1.7532 2.2887 1.3174 2.0619 1.8089 1.4870 1.5005 1.5763 1.9814 1.5195 1.2600 1.0625 1.4613 2.3541 1.6246 1.2699 1.2661 2.8388 1.3951 1.4564 1.3549 1.2295 1.6830 2.7181 1.7979 3.6223 5.8929 4.1997 2.4165 4.4488 2.2563 1.0882 1.0982 1.0978 1.1521 3.3040 6.5555 6.2231 6.2825 6.3772 1.0635 1.0659 1.0798 1.0753 1.0812 1.0857 1.1005 1.1051 1.0848 1.0886 1.0869 1.0872 1.0930 1.0963 1.0953 1.0964 1.0986
irintensity: 0.8689 0.5296 1.5039 0.3925 0.0811 0.2050 1.3127 2.3356 0.4514 5.8955 0.1476 0.2120 0.9234 1.0285 1.9235 0.0074 0.1958 2.0682 0.2447 23.9731 30.9111 24.0730 3.5061 0.0373 1.7213 0.0956 51.3327 11.8380 0.0251 38.5385 3.3438 1.8613 87.3429 0.0608 12.2686 8.3853 2.0351 5.6375 0.5346 7.9364 35.4502 2.2684 1.6338 0.0521 0.3347 2.5363 1.8836 1.1631 11.5276 2.0971 12.1457 4.4234 10.2544 65.9376 14.4577 164.0858 0.1685 4.3776 18.7289 10.5482 29.6544 10.6235 8.5744 3.2037 43.5278 18.3692 0.0219 67.9726 333.7109 28.0800 67.5076 121.8142 159.8885 7.9952 1.7848 5.8824 9.3630 56.9973 0.7650 111.6868 113.9222 55.0133 4.5971 7.8004 657.7358 95.9281 68.2652 10.6676 7.0955 75.6817 53.0985 52.9070 52.0419 5.4869 12.6416 17.7807 2.8650 29.6996 29.2931 16.6453 32.1965 24.5373
temp: 298.150 k
press: 1.00000 atm
elementType: 7 7 7 6 6 6 6 6 6 6 6 6 6 6 6 6 6 6 6 1 1 1 1 1 1 1 1 1 1 1 1 1 1 1 1 1
symmnumber: 1
zpe: 773809.3 jmol-1
zpe.correction: 0.294728 hartree
zpe.thermalcorrener: 0.310884 hartree
zpe.thermalcorrenthalpy: 0.311828 hartree
zpe.thermalcorrgfe: 0.249277 hartree
zpe.sumelectzpe: -782.764234 hartree
zpe.sumelectthermal: -782.748078 hartree
zpe.sumelectthermalent: -782.747134 hartree
zpe.sumelectthermalfe: -782.809686 hartree
dipole: 6.1397 -0.1997 0.0034
dipole: 6.1430
quadrupole: -74.8859 -101.1853 -117.6929
quadrupole: -0.6731 0.0310 -0.5126
quadrupole: 23.0354 -3.2639 -19.7715 -0.6731 0.0310 -0.5126
hfenergy: -783.0589623 hartree
pointgroup: C01 [X(C16H17N3)]
dipole: -2.4155646 -0.0202911 -0.0755705 debye
polarizability: 536.4830426|-7.4247467|114.1292403|-4.4572494|39.2290923|157.9705001 unknown
InChI: InChI=1S/C16H17N3/c1-2-6-14(7-3-1)17-18-15-8-10-16(11-9-15)19-12-4-5-13-19/h1-3,6-11H,4-5,12-13H2
charge 0 multiplicity 1
36 atoms
N  -4.093241 0.024056 -0.065039
N  1.538941 0.281587 0.492383
N  2.293173 -0.256915 -0.44309
C  -6.278747 -0.712078 -0.662342
C  -6.397609 0.576456 0.190978
C  -4.810614 -0.68709 -1.149128
C  -5.020855 0.67393 0.889839
C  -2.714113 0.075188 0.048037
C  -1.867849 -0.495714 -0.96578
C  -2.086104 0.698636 1.176791
C  -0.476154 -0.447637 -0.853321
C  -0.689871 0.74296 1.278028
C  0.143369 0.174202 0.274127
C  3.700762 -0.136396 -0.203261
C  4.288488 0.509998 0.923126
C  4.537222 -0.721599 -1.19162
C  5.689733 0.562122 1.045481
C  5.940742 -0.665042 -1.061432
C  6.52286 -0.023323 0.057412
H  -6.451307 -1.603208 -0.031583
H  -6.995113 -0.741222 -1.500151
H  -6.55079 1.453569 -0.463971
H  -7.229787 0.538965 0.913467
H  -4.402839 -1.705602 -1.291583
H  -4.711883 -0.14408 -2.11305
H  -4.723366 1.723038 1.07826
H  -5.020864 0.142053 1.865119
H  -2.317965 -0.964237 -1.846792
H  -2.696127 1.133653 1.973737
H  0.167897 -0.8793 -1.626052
H  -0.204744 1.214661 2.13946
H  3.628202 0.95534 1.673608
H  4.059816 -1.211441 -2.04714
H  6.142504 1.058985 1.911613
H  6.579193 -1.118668 -1.827808
H  7.612939 0.021951 0.161077
