program: Gaussian 09
title: 000114760
version: EM64L-G09RevD.01
frameworkgroup: C1[X(C10H3Cl5)]
method: RPBEPBE
basis: SDD
operation: Freq
keyword: #pfreq=noraman
keyword: PBEPBE/SDD
title: #p freq=noraman PBEPBE/SDD
converged: NO NO NO NO
title: Mulliken charges:
elementType: Cl Cl Cl Cl Cl C C C C C C C C C C H H H
charge: 0.022566 0.007156 0.003441 0.022015 -0.019290 0.676651 0.524594 -0.360377 -0.361215 -0.311951 -0.385823 -0.119297 -0.222893 -0.225256 -0.120819 0.292558 0.289347 0.288594
chargesum: 0.00000
title: Mulliken charges with hydrogens summed into heavy atoms:
elementType: Cl Cl Cl Cl Cl C C C C C C C C C C
charge: 0.022566 0.007156 0.003441 0.022015 -0.019290 0.676651 0.524594 -0.360377 -0.361215 -0.311951 -0.093265 -0.119297 0.066454 0.063338 -0.120819
polarizability: 2.32003201e+02 4.41350154e+00 2.10430872e+02 3.21192583e-03 -1.32956534e-03 5.40380799e+01
1716.lowfreq: -0.0024 -0.0023 -0.0017 6.1944 6.3121 9.3547 26.9141 52.6180 107.1624
frequency: 26.9101 52.6165 107.1614 140.6769 148.6288 177.8155 191.4030 208.4368 215.1274 254.5975 297.0873 299.1478 321.9242 335.6740 397.3256 413.9939 506.4585 510.5596 534.6680 565.1860 584.2981 635.5669 639.5122 646.8393 758.8459 766.9549 847.3471 862.7087 869.9255 890.8257 914.4948 971.3563 1116.4421 1159.3068 1193.1605 1200.3656 1285.1186 1334.6259 1357.9845 1379.9246 1397.1739 1480.0697 1558.9854 1569.7898 1598.3605 3182.9140 3183.9964 3187.1170
redmass: 30.5590 27.5373 12.7754 28.8323 7.4743 26.0680 5.1107 28.2505 31.7224 19.7950 5.9577 26.0586 28.8989 8.8073 13.4613 8.1210 6.8869 9.9348 5.0049 6.5673 3.7731 7.6411 6.5224 11.4937 5.6696 11.4236 8.1129 1.4127 1.4184 1.4564 8.2638 8.8016 2.0904 2.7164 1.7049 4.0266 2.3882 3.9221 4.4830 3.8307 3.8669 5.9841 8.8053 9.1473 7.8548 1.0931 1.0933 1.0925
irintensity: 0.0021 0.0384 0.1096 0.0074 0.0001 0.2808 0.0520 0.0158 0.7041 0.2762 3.2725 0.1166 0.0020 0.0775 12.8544 4.8222 1.1210 21.3187 10.7119 1.5465 0.1892 11.7571 1.8000 56.5791 8.8427 25.7530 31.5017 7.1840 38.4309 14.5907 19.5528 87.0380 51.3181 96.1344 0.4635 45.1457 47.9924 23.7787 15.7796 24.9455 20.9987 14.0551 100.1843 34.5747 124.6802 3.2042 3.3124 3.9642
temp: 298.150 k
press: 1.00000 atm
elementType: 17 17 17 17 17 6 6 6 6 6 6 6 6 6 6 1 1 1
symmnumber: 1
zpe: 252887.0 jmol-1
zpe.correction: 0.096320 hartree
zpe.thermalcorrener: 0.109908 hartree
zpe.thermalcorrenthalpy: 0.110853 hartree
zpe.thermalcorrgfe: 0.053817 hartree
zpe.sumelectzpe: -2682.118086 hartree
zpe.sumelectthermal: -2682.104497 hartree
zpe.sumelectthermalent: -2682.103553 hartree
zpe.sumelectthermalfe: -2682.160589 hartree
dipole: -0.0447 0.0099 0.0002
dipole: 0.0457
quadrupole: -119.5965 -122.4443 -121.9104
quadrupole: 2.4595 -0.0002 0.0004
quadrupole: 1.7205 -1.1272 -0.5934 2.4595 -0.0002 0.0004
hfenergy: -2682.2144057 hartree
pointgroup: C01 [X(C10H3Cl5)]
dipole: 0.0168346 0.0063595 -0.0000781 debye
dipolederiv: -0.0716845 -0.0779016 0.0000267 -0.1880267 -0.6623342 0.0002301 0.0000936 0.0003507 -0.0076506 -0.0929336 0.0326447 0.0000014 0.0557321 -0.7485107 -0.0000959 0.0000079 -0.0001334 -0.0196592 -0.192838 -0.2230853 -0.000017 -0.2507802 -0.6403918 -0.0000581 -0.0000225 -0.0000719 -0.0245949 -0.7777864 -0.166244 -0.0001544 -0.2246466 -0.10184 -0.0000577 -0.0001921 -0.0000404 -0.0125426 -0.6371919 0.3344282 0.0000308 0.4421322 -0.3939839 -0.0000287 0.0000321 -0.0000211 -0.0433282 -0.0820076 -0.1099712 0.0000025 -0.0490924 -0.5116414 -0.0000603 -0.0000351 -0.0001222 0.0955709 0.2646705 -0.1116226 0.0000131 -0.1478656 -0.1228281 0.0001149 -0.0000312 0.0001241 0.0779579 0.2368061 0.1297814 0.0000453 -0.2290362 1.1601915 0.0001846 0.0000256 0.0003051 -0.0961612 -0.3393053 0.2124321 -0.0001453 0.2452585 0.920919 -0.000532 -0.0002849 -0.0007111 -0.0830164 0.3805334 0.1410059 0.0000027 0.4979987 1.02968 0.0001246 0.0000738 0.0001184 -0.0763775 -0.54053 0.1577955 0.0000208 0.101085 -0.2070483 0.0000124 0.0000799 0.0000526 -0.1135614 1.2106016 0.2119318 0.0003178 0.2960241 0.1113772 0.0002566 0.0004529 0.0003001 -0.0395578 -0.3719747 -0.2027315 -0.0001025 -0.039919 -0.3054009 -0.0000899 -0.0000503 -0.0000825 -0.0452937 -0.274952 0.2514731 0.0000074 0.0623938 -0.462957 -0.0000503 -0.0000218 -0.0000525 -0.0537767 1.0548498 -0.5522885 -0.0000435 -0.5891055 0.7405982 0.0000586 -0.0000551 0.0000395 -0.060525 0.1243132 -0.0220204 -0.0000092 0.0210011 0.0467659 -0.0000092 -0.0000051 0.0000052 0.1710693 0.0649019 0.0232037 -0.0000047 0.0194014 0.0572857 0.000003 -0.0000644 -0.000059 0.1651351 0.0445274 -0.0288312 0.0000081 -0.0225547 0.0901189 -0.0000026 -0.0000033 -0.0000017 0.1663121 unknown
polarizability: 232.8119716|-1.1738077|209.6221013|0.0029883|0.001776|54.0380799 unknown
InChI: InChI=1S/C10H3Cl5/c11-4-1-5-9(6(12)2-4)7(13)3-8(14)10(5)15/h1-3H
charge 0 multiplicity 1
18 atoms
Cl -1.65846 -2.984286 0.000756
Cl -0.920657 3.421805 0.000322
Cl 2.15563 2.903693 0.00018
Cl -4.16273 -0.916082 -0.00059
Cl 3.766493 -2.295898 -0.000239
C  0.217397 0.763787 -0.00002
C  -0.02122 -0.688934 -0.000045
C  -0.957677 1.60385 0.000018
C  -1.370949 -1.1959 -0.000059
C  1.605171 1.169336 -0.000028
C  1.07446 -1.610157 -0.000138
C  -2.457854 -0.327224 -0.000149
C  -2.247405 1.075541 -0.000081
C  2.659355 0.25384 -0.000135
C  2.376527 -1.134334 -0.000179
H  0.872792 -2.682918 -0.000201
H  -3.110624 1.744971 -0.000126
H  3.692151 0.60981 -0.000184
