program: Gaussian 09
title: 000114731
version: EM64L-G09RevD.01
frameworkgroup: C1[X(C10H4Cl4)]
method: RPBEPBE
basis: SDD
operation: Freq
keyword: #pfreq=noraman
keyword: PBEPBE/SDD
title: #p freq=noraman PBEPBE/SDD
converged: NO NO NO NO
title: Mulliken charges:
elementType: Cl Cl Cl Cl C C C C C C C C C C H H H H
charge: 0.015800 -0.022787 0.012596 -0.033894 0.526549 0.547622 -0.345283 -0.361205 -0.354792 -0.377322 -0.112093 -0.262784 -0.119765 -0.224388 0.288811 0.271092 0.287288 0.264556
chargesum: 0.00000
title: Mulliken charges with hydrogens summed into heavy atoms:
elementType: Cl Cl Cl Cl C C C C C C C C C C
charge: 0.015800 -0.022787 0.012596 -0.033894 0.526549 0.547622 -0.345283 -0.361205 -0.065981 -0.106230 -0.112093 0.024504 -0.119765 0.040168
polarizability: 2.27446726e+02 -1.18004997e+00 1.79568804e+02 -3.53144741e-03 4.69904050e-03 5.11243601e+01
1716.lowfreq: -0.0027 -0.0021 -0.0012 4.2695 6.5426 6.6984 56.7015 81.5178 120.4451
frequency: 56.7001 81.5173 120.4421 135.3216 181.7882 184.6255 201.6353 272.8112 275.9647 307.4115 325.3536 339.3415 384.9948 425.1900 487.7768 535.0972 539.9007 579.7425 614.4424 634.2959 643.4609 701.7617 767.6306 834.7626 844.7147 861.5680 896.4172 904.1918 956.9473 972.5246 1082.2402 1141.1007 1161.7909 1203.3707 1254.2516 1285.8377 1357.1008 1397.4534 1401.5697 1417.4385 1486.2284 1559.8843 1575.5946 1615.7220 3158.9690 3178.9309 3181.0817 3183.0286
redmass: 27.5028 8.7860 6.8424 26.7545 26.8575 6.4981 27.7812 5.5209 13.2547 18.7220 16.6314 7.9591 9.3039 3.3636 8.9068 6.3085 5.2220 4.1870 7.4007 9.5053 5.4239 8.1540 2.9900 1.6171 7.8795 1.4334 1.5019 6.9200 7.4858 1.3342 2.3599 1.7348 1.5993 3.2532 1.6606 2.1816 3.5615 4.4883 5.3154 4.2628 3.9048 10.1479 7.9325 7.4927 1.0881 1.0952 1.0949 1.0933
irintensity: 0.0135 0.4376 0.0419 0.0329 0.1538 0.2714 0.0530 1.2626 0.7720 0.9715 0.5552 0.5857 11.0116 10.8629 15.1703 8.8270 9.2109 0.6276 8.6499 38.9187 0.2708 24.2267 0.3444 49.6702 12.9571 18.4958 19.6785 0.1352 138.2196 0.7955 47.5260 14.8515 39.8796 32.2833 25.8234 21.2862 22.8030 5.2977 29.1911 30.7652 50.1821 6.8688 48.9883 79.1132 0.1938 0.0263 3.7611 3.4884
temp: 298.150 k
press: 1.00000 atm
elementType: 17 17 17 17 6 6 6 6 6 6 6 6 6 6 1 1 1 1
symmnumber: 1
zpe: 279387.4 jmol-1
zpe.correction: 0.106413 hartree
zpe.thermalcorrener: 0.118604 hartree
zpe.thermalcorrenthalpy: 0.119548 hartree
zpe.thermalcorrgfe: 0.066478 hartree
zpe.sumelectzpe: -2222.745110 hartree
zpe.sumelectthermal: -2222.732919 hartree
zpe.sumelectthermalent: -2222.731975 hartree
zpe.sumelectthermalfe: -2222.785045 hartree
dipole: -0.2945 1.5893 0.0001
dipole: 1.6164
quadrupole: -108.3018 -106.3665 -110.3626
quadrupole: -1.8489 0.0001 0.0002
quadrupole: 0.0419 1.9771 -2.0190 -1.8489 0.0001 0.0002
hfenergy: -2222.8515226 hartree
pointgroup: C01 [X(C10H4Cl4)]
dipole: 0.135799 0.6212715 -0.0000492 debye
dipolederiv: -0.0456933 0.0380985 0.0000013 -0.0753868 -0.6916493 0.0000223 0.0000031 -0.0000072 -0.0114359 -0.1253151 0.0487712 -0.000002 0.1245527 -0.7976469 0.0000322 -0.0000089 0.0000511 -0.0428787 -0.6923611 -0.25571 0.0000117 -0.3332547 -0.1930047 0.0000107 -0.0000045 0.0000029 -0.0192043 -0.8199676 0.2292033 0.0000122 0.3768194 -0.232176 -0.0000048 0.0000035 -0.0000014 -0.0552201 0.2911107 0.0248524 -0.0000153 -0.0893943 -0.1926442 0.000013 -0.0000077 -0.0000065 0.078916 -0.0854781 0.0137695 0.0000024 0.1234425 -0.3560175 0.0000127 0.0000083 0.0000322 0.0531076 -0.3162533 -0.035685 0.0000022 0.0221541 0.9734431 -0.0000285 -0.0000118 0.0000208 -0.0889917 0.3006943 -0.0556245 -0.0000005 -0.2944449 1.2252758 -0.0000554 0.0000086 -0.0000884 -0.086514 -0.5070406 0.0884305 0.0000053 0.0098865 -0.1013869 -0.0000014 0.0000102 -0.0000073 -0.1089617 0.1056625 -0.0716962 -0.0000031 0.100626 0.0305629 -0.0000109 -0.0000109 -0.0000126 -0.1305091 1.0232845 0.3603918 -0.0000102 0.5061276 0.2001832 -0.0000158 0.0000108 -0.0000328 -0.0370815 -0.3454256 -0.1467184 0.0000127 -0.108461 -0.3453621 0.0000098 0.0000029 0.0000232 -0.0568673 1.2320969 -0.4509537 -0.0000193 -0.5537115 0.3913508 0.0000007 -0.0000105 0.0000031 -0.059419 -0.2699283 0.2201377 -0.0000051 0.2040243 -0.0784203 -0.0000053 -0.0000066 -0.000008 -0.0990891 0.1137172 -0.007483 0.0000035 0.0345083 0.0342547 0.0000035 0.000003 0.0000072 0.1685909 0.0902187 0.0307945 0.0000003 -0.022464 -0.0085666 0.0000074 0.000002 0.0000082 0.1600747 0.0534253 0.0311453 -0.0000032 0.0215736 0.0718716 0.0000053 -0.0000025 0.000009 0.170922 -0.0027473 -0.061724 0.000007 -0.0465979 0.0699322 0.0000046 0.0000109 0.0000066 0.1645611 unknown
polarizability: 227.4732102|-0.3518649|179.5423197|-0.0036798|-0.0045838|51.1243601 unknown
InChI: InChI=1S/C10H4Cl4/c11-5-1-2-6-7(3-5)10(14)9(13)4-8(6)12/h1-4H
charge 0 multiplicity 1
18 atoms
Cl -0.989649 -3.042265 0.000136
Cl -1.233847 3.404088 -0.000123
Cl -3.826637 -1.447173 0.000099
Cl 4.256984 -1.23501 -0.000082
C  0.208131 -0.497583 0.000034
C  0.165627 0.95719 -0.000018
C  -1.030737 -1.231134 0.000119
C  -1.122156 1.587988 -0.000018
C  1.481895 -1.153243 -0.000009
C  1.397724 1.686579 -0.000089
C  -2.252778 -0.559008 0.000094
C  -2.308649 0.865651 0.00001
C  2.646591 -0.393876 -0.000069
C  2.628118 1.030628 -0.000096
H  1.524023 -2.24482 0.00003
H  1.361194 2.779711 -0.000139
H  -3.278588 1.368456 -0.00004
H  3.566653 1.59162 -0.000141
