program: Gaussian 09
title: 000114710
version: EM64L-G09RevD.01
frameworkgroup: C1[X(C23H30N2OS)]
method: RPBEPBE
basis: SDD
operation: Freq
keyword: #p
keyword: freq=noraman
keyword: PBEPBE/SDD
title: #p freq=noraman PBEPBE/SDD
converged: YES YES NO NO
title: Mulliken charges:
elementType: S O N N C C C C C C C C C C C C C C C C C C C C C C C H H H H H H H H H H H H H H H H H H H H H H H H H H H H H H
charge: 0.149569 -0.437341 -0.095675 -0.066956 -0.175210 -0.367546 -0.372159 -0.379273 -0.390049 -0.634863 0.579670 -0.310907 0.628752 -0.374638 -0.648075 -0.428243 -0.322142 0.514171 -0.263178 -0.431191 -0.424668 -0.318196 -0.279410 -0.544522 -0.251032 -0.245067 -0.673103 0.197188 0.227473 0.183007 0.184256 0.227394 0.199929 0.191753 0.195901 0.202647 0.227308 0.250257 0.170749 0.201637 0.245445 0.234670 0.194336 0.249724 0.228748 0.237179 0.215719 0.180655 0.244032 0.211039 0.209612 0.228521 0.229744 0.222469 0.218357 0.222648 0.328887
chargesum: 0.00000
title: Mulliken charges with hydrogens summed into heavy atoms:
elementType: S O N N C C C C C C C C C C C C C C C C C C C C C C C
charge: 0.149569 -0.108454 -0.095675 -0.066956 0.021978 0.042934 0.039491 0.012409 0.008498 -0.157298 0.579670 0.061479 0.628752 -0.374638 -0.402630 0.000762 -0.322142 0.514171 -0.013454 -0.202443 -0.187489 0.078179 -0.035378 -0.123870 -0.022511 -0.015323 -0.009629
polarizability: 2.59071721e+02 -4.80970738e+01 3.57858308e+02 8.03636621e+00 8.32798997e-01 2.41211011e+02
1716.lowfreq: -4.7477 -0.0011 0.0010 0.0013 3.8608 9.9643 17.7035 24.1440 31.4803
frequency: 17.4340 23.8367 31.4309 35.9564 38.6728 53.7954 59.2343 73.6547 79.9216 101.8524 112.8809 142.6994 157.1030 162.4312 185.0325 207.6379 211.2651 223.0881 237.8654 246.2595 260.5710 275.4013 286.8359 308.8301 313.1808 324.8974 341.1856 355.1565 384.7385 403.2997 423.4018 429.6922 443.5032 455.2842 465.7256 490.6966 505.0686 507.6218 543.3695 577.6384 613.2512 626.9452 647.1869 654.1670 675.7560 711.4867 735.9270 747.4090 759.8346 762.9639 771.6637 775.3607 787.8579 838.1618 845.0533 847.0981 861.1207 868.3669 878.0221 914.3621 935.1519 943.8070 956.2222 961.3348 962.5453 973.1917 978.8350 1005.4784 1007.0555 1027.9044 1035.4572 1038.3746 1051.0072 1056.4217 1058.4470 1061.8696 1065.5189 1071.9889 1078.6136 1101.0654 1122.9309 1124.2671 1131.7944 1141.7272 1145.7682 1157.1410 1171.7064 1175.9091 1189.4532 1204.2301 1208.3531 1214.6300 1242.0461 1245.1632 1247.8186 1254.4988 1261.9721 1265.6231 1272.5123 1287.6319 1292.8914 1299.7551 1308.6157 1313.5843 1330.7653 1336.3314 1339.8686 1350.0173 1360.9482 1370.1264 1377.6350 1379.8302 1382.7845 1385.1591 1388.0815 1395.0519 1415.1045 1420.2742 1452.1606 1452.6124 1459.5910 1463.2175 1465.4862 1466.6000 1471.1530 1471.3538 1475.2736 1478.4847 1481.0871 1487.5694 1489.8545 1575.5529 1580.3196 1598.5877 1607.1644 2802.6575 2824.2822 2842.6871 2852.8662 2860.9137 2872.1917 2944.7534 2974.1696 2979.5128 2985.8448 2986.8291 2999.7758 3023.6225 3033.8559 3037.7798 3043.8475 3051.2578 3057.6004 3060.3577 3075.6574 3078.6632 3083.4540 3104.4978 3110.9395 3121.8224 3125.1566 3141.9560 3147.3868 3163.5906 3558.8200
redmass: 5.0287 5.1159 4.1015 2.8372 2.3009 4.1650 2.2730 4.4206 4.3832 4.1705 3.4843 3.1841 3.5752 2.8595 3.8225 3.1608 1.7603 3.2730 3.1155 2.1291 2.5093 3.7021 3.5376 1.5489 2.0637 2.4315 3.6389 4.4216 2.4366 2.3111 5.2138 4.6075 3.4107 4.2024 3.1066 3.1504 3.5973 4.0966 4.5382 3.8222 3.1649 4.2557 4.4936 4.6573 3.8205 3.8482 3.6739 1.6977 2.1756 4.1400 1.2229 2.6770 1.2072 1.3820 1.5593 2.6162 1.7519 1.2450 2.6117 1.5094 1.8255 1.8351 2.9257 1.9577 1.8037 2.3468 1.3348 2.7575 2.4534 6.4124 4.1508 2.6672 2.4295 2.5209 1.7563 2.1135 2.0726 1.9954 1.7449 1.9162 1.7978 2.2061 2.6621 1.7692 2.8099 2.1909 1.3080 1.1696 1.2172 1.6942 1.5995 1.6731 1.3721 1.2703 1.4862 1.4790 1.4155 1.4309 1.3974 1.0935 1.2601 1.4016 1.2809 1.5427 1.3523 1.4396 1.3003 1.4720 2.1122 1.4549 2.6711 3.5858 1.2848 1.5233 1.2584 1.4279 2.5750 2.0412 1.0790 1.0789 1.1021 1.4049 1.1995 1.0944 1.3584 1.0902 1.1003 1.5183 1.4152 1.0946 1.1036 6.8923 6.7375 6.2771 6.1934 1.0806 1.0706 1.0713 1.0702 1.0706 1.0685 1.0693 1.0655 1.0348 1.0617 1.0600 1.0844 1.0893 1.0994 1.1018 1.0888 1.0929 1.0863 1.0882 1.0996 1.1001 1.1012 1.0906 1.0877 1.0878 1.0874 1.0928 1.0962 1.1008 1.0661
irintensity: 0.1505 0.7276 0.5679 0.0328 1.5625 1.8068 1.7419 0.7653 0.3041 0.3595 1.2464 3.9141 0.4086 1.5290 0.2022 0.2672 0.4314 0.0168 1.1611 0.6435 2.6013 3.6641 0.2768 93.2253 59.4322 4.4101 19.8985 0.3359 2.0398 1.7868 0.4871 5.0624 1.2071 0.9398 4.7936 4.4716 4.5037 6.0651 1.3737 2.3940 2.3473 2.4284 5.5546 17.3625 4.6205 0.9101 1.1301 66.4683 18.0876 5.7955 2.2141 18.0709 2.7421 31.3868 0.4489 10.6273 9.7188 12.1056 1.2229 14.4101 2.2904 0.4481 34.9766 52.4920 46.4843 3.9071 0.1483 3.5620 16.7005 72.4470 7.0210 13.6251 7.7058 12.4018 3.4943 14.1884 5.8640 13.1682 9.3742 5.4373 4.7704 73.6616 21.0704 2.9875 49.2884 5.7872 2.1044 0.6304 1.2167 1.2397 7.1902 0.2137 0.9095 2.3390 8.8179 16.8820 7.6508 3.3594 19.3981 3.4981 6.6203 17.9667 13.1782 3.1500 12.0219 16.7922 11.3038 4.1116 1.3896 3.4096 0.4188 0.1602 30.5826 9.2894 7.5981 2.6384 6.4006 12.9631 2.4586 1.9388 26.3782 39.9886 5.0604 0.3230 8.2413 10.8062 2.2490 11.9423 60.7917 8.6845 16.3131 17.6300 10.9850 4.9290 0.3573 65.8303 74.4188 69.2269 28.9428 10.9631 228.8711 73.3966 11.9479 41.5812 17.9770 47.8122 35.0991 50.9700 20.3854 7.7145 44.0606 6.4108 42.2940 7.2933 59.2709 68.0832 38.0678 15.0124 11.0632 15.3136 1.9883 19.2035 14.1639 35.9824 7.1059
temp: 298.150 k
press: 1.00000 atm
elementType: 16 8 7 7 6 6 6 6 6 6 6 6 6 6 6 6 6 6 6 6 6 6 6 6 6 6 6 1 1 1 1 1 1 1 1 1 1 1 1 1 1 1 1 1 1 1 1 1 1 1 1 1 1 1 1 1 1
symmnumber: 1
zpe: 1262809.4 jmol-1
zpe.correction: 0.480979 hartree
zpe.thermalcorrener: 0.507405 hartree
zpe.thermalcorrenthalpy: 0.508349 hartree
zpe.thermalcorrgfe: 0.421964 hartree
zpe.sumelectzpe: -1475.170751 hartree
zpe.sumelectthermal: -1475.144325 hartree
zpe.sumelectthermalent: -1475.143381 hartree
zpe.sumelectthermalfe: -1475.229766 hartree
dipole: 2.2973 -0.2092 -0.4357
dipole: 2.3476
quadrupole: -194.3970 -157.8108 -159.9909
quadrupole: -19.3348 -7.2233 -5.5599
quadrupole: -23.6641 12.9221 10.7420 -19.3348 -7.2233 -5.5599
hfenergy: -1475.6517302 hartree
pointgroup: C01 [X(C23H30N2O1S1)]
dipole: 0.8453862 0.3180724 0.1929285 debye
polarizability: 241.3389485|15.3497429|375.6284685|-7.3405412|4.2273123|241.1736228 unknown
InChI: InChI=1S/C23H30N2OS/c1-2-18-8-9-23-20(16-18)21(17-19-6-3-4-7-22(19)27-23)25-13-11-24(12-14-25)10-5-15-26/h3-4,6-9,16,21,26H,2,5,10-15,17H2,1H3
charge 0 multiplicity 1
57 atoms
S  1.8697 -0.459337 -1.883668
O  -7.940766 0.309305 -0.909371
N  -0.309086 -0.218559 0.676215
N  -3.193235 -0.621277 0.470957
C  0.971715 0.262819 1.262685
C  -1.223228 0.884337 0.287081
C  -1.024639 -1.16831 1.565334
C  -2.472857 0.329729 -0.413009
C  -2.276916 -1.720294 0.866636
C  1.963734 -0.912583 1.555541
C  1.64909 1.32632 0.402112
C  -4.442986 -1.14834 -0.12905
C  1.992848 -2.077976 0.574252
C  2.14171 1.069407 -0.903269
C  1.869614 2.611567 0.955772
C  -5.535229 -0.073192 -0.313219
C  1.994376 -1.972948 -0.842599
C  2.526436 3.651408 0.254204
C  2.813805 2.091054 -1.620003
C  2.064026 -3.386821 1.129362
C  2.996136 3.368119 -1.052354
C  -6.883563 -0.697285 -0.717605
C  2.056358 -3.140898 -1.65003
C  2.68449 5.036428 0.863699
C  2.130938 -4.549509 0.336366
C  2.122916 -4.422487 -1.071031
C  1.499158 5.975199 0.508902
H  0.776218 0.750065 2.256257
H  -0.69524 1.561513 -0.405536
H  -1.543839 1.481237 1.179443
H  -1.329842 -0.671558 2.522651
H  -0.3614 -2.015365 1.808096
H  -3.140065 1.173934 -0.662004
H  -2.15829 -0.162829 -1.36865
H  -1.950293 -2.322493 -0.018988
H  -2.812885 -2.394578 1.56134
H  1.737375 -1.326611 2.555564
H  2.97311 -0.464008 1.638368
H  -4.245955 -1.652666 -1.113217
H  -4.829718 -1.929213 0.556252
H  1.501788 2.803687 1.97279
H  -5.655834 0.485562 0.632861
H  -5.230801 0.655731 -1.092265
H  3.206152 1.874419 -2.61968
H  2.067897 -3.48216 2.222945
H  3.523963 4.142125 -1.622844
H  -7.270944 -1.343753 0.088463
H  -6.762857 -1.318373 -1.632997
H  2.059118 -3.038622 -2.74159
H  2.763325 4.957796 1.964856
H  3.625869 5.497237 0.507753
H  2.187315 -5.536627 0.807249
H  2.172794 -5.307721 -1.714251
H  1.408902 6.09952 -0.585488
H  1.639136 6.975103 0.959142
H  0.5440 5.560643 0.879171
H  -7.644445 0.952329 -1.602498
