program: Gaussian 09
title: 000114703
version: EM64L-G09RevD.01
frameworkgroup: C1[X(C14H16O3)]
method: RPBEPBE
basis: SDD
operation: Freq
keyword: #pfreq=noraman
keyword: PBEPBE/SDD
title: #p freq=noraman PBEPBE/SDD
converged: YES YES NO NO
title: Mulliken charges:
elementType: O O O C C C C C C C C C C C C C C H H H H H H H H H H H H H H H H
charge: -0.278831 -0.257700 -0.249291 0.222985 -0.223257 0.168762 0.406693 -0.686893 -0.707998 -0.349398 -0.536610 -0.554924 0.194727 0.224729 0.115282 -0.794806 -0.523981 0.233512 0.234354 0.239379 0.214856 0.239450 0.236691 0.203696 0.240632 0.248148 0.279604 0.239602 0.235089 0.260846 0.286693 0.209615 0.228344
chargesum: 0.00000
title: Mulliken charges with hydrogens summed into heavy atoms:
elementType: O O O C C C C C C C C C C C C C C
charge: -0.278831 -0.257700 -0.249291 0.222985 0.010254 0.168762 0.406693 0.001696 -0.028161 -0.108767 -0.288462 -0.275319 0.194727 0.224729 0.115282 -0.059269 0.200671
polarizability: 2.79511719e+02 -6.04227805e+00 1.62274588e+02 3.89893157e+00 -4.53684481e+00 9.71261658e+01
1716.lowfreq: -11.9621 -5.7019 -0.0007 -0.0006 -0.0006 7.0508 33.1773 53.0971 73.7890
frequency: 32.7347 52.9561 73.7778 104.7995 127.4807 152.7272 168.6227 178.0671 192.6002 211.7598 232.0362 237.3148 255.7463 279.9815 286.2616 320.9647 330.1862 382.7495 383.9188 415.7126 426.4953 454.5629 506.3379 540.9050 547.9205 569.8280 582.4694 634.2109 686.4693 697.2693 706.7484 736.0062 762.3131 766.5743 834.6207 868.4880 880.0303 895.8732 917.5766 935.9951 943.4256 957.3646 963.5655 995.7714 1019.6146 1048.2592 1105.4203 1109.4807 1136.7904 1148.8160 1171.5924 1194.7328 1217.9420 1233.7930 1241.6876 1270.3965 1283.5213 1345.2204 1368.7305 1372.0031 1382.3017 1392.1771 1418.9124 1434.3247 1448.4790 1450.7519 1453.4510 1458.5904 1466.8882 1468.5154 1476.0454 1480.7610 1489.3251 1529.2353 1575.8106 1624.4857 1648.0080 2980.7350 2984.8874 2985.7008 2995.4496 3074.8327 3085.2840 3092.8567 3094.6157 3096.1742 3106.8641 3119.4120 3119.4693 3126.1476 3145.8212 3148.4406 3182.6915
redmass: 3.5892 3.4879 4.6174 3.9279 3.7331 3.6019 1.3047 1.0579 1.0233 4.1617 1.6220 1.7789 3.4487 3.7598 2.8875 3.3883 3.1669 3.5430 4.2678 3.2604 4.5082 3.1701 4.4523 3.9446 3.8904 3.3444 6.4021 4.3394 3.5308 5.7412 5.9469 2.6213 3.2431 2.2532 4.1634 2.8025 1.6971 1.4744 1.6018 2.7018 2.0480 3.3088 1.3348 1.3109 1.7589 2.2067 1.5341 1.2444 2.1837 1.7701 2.1038 2.0274 2.3154 3.0372 2.1792 1.6577 4.3694 2.9346 1.2708 1.2252 2.8143 1.3823 2.5771 1.3953 1.1147 1.0516 1.1191 1.0505 1.0597 1.0808 1.0787 1.1016 2.9025 7.5039 6.9597 7.2437 7.8151 1.0323 1.0346 1.0378 1.0355 1.0962 1.0996 1.0993 1.1012 1.0995 1.1008 1.0857 1.0998 1.1054 1.0909 1.0985 1.0919
irintensity: 1.3671 3.4688 3.0875 1.4292 2.6898 1.9204 2.2737 0.1210 0.0295 4.8635 2.9765 0.7538 3.6342 1.5933 8.3355 1.2794 5.8490 3.8558 7.7308 0.1620 7.3448 2.3271 5.0152 10.1089 7.3873 3.6659 8.2354 23.2448 17.9616 3.8797 2.5845 8.8874 4.8708 15.1936 8.2709 39.8427 23.0774 33.0692 4.6629 11.9793 15.5668 7.9939 2.1943 0.6655 2.4910 50.5972 105.9896 6.5038 232.5983 132.7912 29.5059 59.3948 24.1312 106.5850 25.6496 4.3800 159.0748 41.4476 42.6636 30.1685 28.0962 20.9601 14.9514 31.6311 29.4492 7.8485 44.7149 1.6097 20.7188 3.4793 38.4878 6.1184 74.3958 134.0587 235.5401 202.7307 88.4806 69.3270 15.5135 4.6678 24.7131 14.3309 9.3790 34.4600 21.5412 27.2376 27.1315 2.4089 15.6516 12.1323 2.7328 25.4950 0.0720
temp: 298.150 k
press: 1.00000 atm
elementType: 8 8 8 6 6 6 6 6 6 6 6 6 6 6 6 6 6 1 1 1 1 1 1 1 1 1 1 1 1 1 1 1 1
symmnumber: 1
zpe: 694053.4 jmol-1
zpe.correction: 0.264351 hartree
zpe.thermalcorrener: 0.281292 hartree
zpe.thermalcorrenthalpy: 0.282236 hartree
zpe.thermalcorrgfe: 0.220338 hartree
zpe.sumelectzpe: -767.478564 hartree
zpe.sumelectthermal: -767.461624 hartree
zpe.sumelectthermalent: -767.460680 hartree
zpe.sumelectthermalfe: -767.522578 hartree
dipole: -3.1478 2.4338 -1.8614
dipole: 4.3928
quadrupole: -93.7820 -93.7616 -103.5950
quadrupole: -1.6574 -10.6061 0.2831
quadrupole: 3.2642 3.2846 -6.5488 -1.6574 -10.6061 0.2831
hfenergy: -767.7429155 hartree
pointgroup: C01 [X(C14H16O3)]
dipole: -1.2081583 1.0025 -0.7226954 debye
polarizability: 279.0589479|-9.137888|162.8149964|4.8469387|-3.5241728|97.0385285 unknown
InChI: InChI=1S/C14H16O3/c1-9(15)11-7-10-5-6-14(2,3)17-12(10)8-13(11)16-4/h5-8H,1-4H3
charge 0 multiplicity 1
33 atoms
O  -2.343125 -1.0662 -0.361498
O  2.2140 -2.24776 -0.118066
O  3.934527 0.117078 0.767737
C  -3.48344 -0.099813 -0.085887
C  -3.120945 1.312789 -0.522615
C  -1.033178 -0.600845 -0.27672
C  -0.722948 0.793005 -0.399419
C  -3.750523 -0.152693 1.437219
C  -4.656206 -0.676293 -0.895852
C  -1.826958 1.727828 -0.623087
C  0.629056 1.170016 -0.34904
C  -0.009882 -1.552789 -0.180039
C  1.702471 0.243814 -0.172014
C  1.351596 -1.157525 -0.150338
C  3.052889 0.789588 0.143866
C  3.365619 2.243128 -0.229998
C  3.549993 -2.211378 -0.73811
H  -3.958591 1.994165 -0.711017
H  -3.991217 -1.185548 1.745164
H  -2.864125 0.190069 1.998607
H  -4.599741 0.503904 1.700665
H  -4.431393 -0.652394 -1.975199
H  -4.843257 -1.722236 -0.598666
H  -5.572882 -0.087983 -0.710366
H  -1.589876 2.763401 -0.894393
H  0.862597 2.238091 -0.413483
H  -0.246866 -2.619227 -0.161517
H  2.890765 2.941344 0.485682
H  3.017526 2.505038 -1.244447
H  4.455498 2.385069 -0.162996
H  4.286723 -1.808793 -0.0268
H  3.539926 -1.589531 -1.653425
H  3.762466 -3.261019 -0.994845
