program: Gaussian 09
title: 000114661
version: EM64L-G09RevD.01
frameworkgroup: C1[X(C4H6Cl2)]
method: RPBEPBE
basis: SDD
operation: Freq
keyword: #pfreq=noraman
keyword: PBEPBE/SDD
title: #p freq=noraman PBEPBE/SDD
converged: NO YES NO NO
title: Mulliken charges:
elementType: Cl Cl C C C C H H H H H H
charge: -0.067754 -0.061263 0.093651 -0.108800 -0.646920 -0.707961 0.224706 0.265530 0.288769 0.247924 0.233110 0.239010
chargesum: 0.00000
title: Mulliken charges with hydrogens summed into heavy atoms:
elementType: Cl Cl C C C C
charge: -0.067754 -0.061263 0.093651 0.115906 -0.092621 0.012082
polarizability: 8.18005183e+01 -8.95305864e+00 6.42332331e+01 7.56220725e-01 -2.22078753e+00 4.33365499e+01
1716.lowfreq: -10.5731 -2.4644 -0.0032 -0.0026 0.0024 10.7978 65.0559 110.8287 125.9904
frequency: 65.0521 110.7883 125.9895 216.5270 276.7425 332.8139 460.3110 524.5070 582.4295 641.4306 820.4998 873.8583 953.1185 1037.6781 1098.2593 1132.6949 1171.4808 1250.0630 1297.2352 1394.1995 1438.5520 1460.2833 1465.7291 1676.3943 2977.7312 3051.3635 3065.2944 3091.8742 3115.0635 3150.6383
redmass: 5.4829 1.0652 5.8004 3.9770 3.0584 2.7717 4.8869 5.0007 5.1793 5.6262 1.1864 1.6767 1.4701 1.5181 1.7765 2.4611 1.7104 1.1662 1.2553 1.2259 1.1154 1.0609 1.0481 7.2530 1.0381 1.0963 1.0573 1.0896 1.0972 1.1106
irintensity: 1.1695 0.3087 1.6104 1.3560 3.4400 2.9147 8.0125 8.6733 39.9265 69.3853 14.8074 13.9237 52.7467 0.5446 4.5733 6.6783 14.1745 21.1634 21.0633 17.8539 13.6979 18.1994 16.4337 26.4149 17.2347 17.5632 12.7189 5.6361 15.5469 4.2418
temp: 298.150 k
press: 1.00000 atm
elementType: 17 17 6 6 6 6 1 1 1 1 1 1
symmnumber: 1
zpe: 232426.1 jmol-1
zpe.correction: 0.088526 hartree
zpe.thermalcorrener: 0.096026 hartree
zpe.thermalcorrenthalpy: 0.096970 hartree
zpe.thermalcorrgfe: 0.055404 hartree
zpe.sumelectzpe: -1075.649840 hartree
zpe.sumelectthermal: -1075.642340 hartree
zpe.sumelectthermalent: -1075.641396 hartree
zpe.sumelectthermalfe: -1075.682962 hartree
dipole: 2.2348 -2.1857 1.5415
dipole: 3.4854
quadrupole: -50.8185 -48.4445 -49.0713
quadrupole: -2.7649 -3.3725 -0.9190
quadrupole: -1.3737 1.0003 0.3735 -2.7649 -3.3725 -0.9190
hfenergy: -1075.7383659 hartree
pointgroup: C01 [X(C4H6Cl2)]
dipole: -0.890399 -0.7149075 -0.7592349 debye
dipolederiv: -0.1782399 0.0847749 0.0530724 0.032777 -0.6369358 -0.1498972 0.0458901 -0.1802629 -0.1194159 -0.6607625 -0.0077278 -0.1106635 0.0723619 -0.1637379 0.0173415 -0.3802103 0.0138004 -0.3177595 -0.205185 -0.0882477 -0.0876036 -0.1715248 0.949977 0.258959 0.0403653 0.3824097 -0.125579 0.2634837 0.0680867 -0.1040896 0.066825 -0.1725803 0.0325885 -0.1761605 -0.0518644 -0.1442284 0.8830412 0.0208911 0.2650643 -0.0668004 -0.0104752 -0.0688996 0.3974601 -0.1116129 0.4339772 -0.2115893 0.0084283 0.0819193 -0.1206799 -0.016336 -0.0179544 0.1307327 -0.0197697 0.069139 0.0360674 0.0309915 0.046851 0.0860183 -0.0656709 -0.072234 0.0468712 -0.0626664 0.1141383 0.0097892 0.0054923 -0.068612 0.031548 -0.0389876 -0.0953005 -0.0476875 -0.0697873 0.015202 -0.0200606 -0.0307265 -0.0250056 -0.0410965 0.0358056 0.0985197 -0.0487893 0.0648368 -0.0018435 0.0879503 -0.0116394 0.0052283 0.0871937 -0.0522287 -0.0554155 0.0215077 -0.0352014 0.1050823 -0.0414546 -0.0533637 -0.0806403 0.0034256 0.1213479 -0.0638893 -0.1172204 -0.0524103 -0.011597 0.0369601 -0.0269597 0.0244793 0.0199521 0.0498218 0.1161819 0.087241 0.1225283 -0.0171156 unknown
polarizability: 82.5785683|7.1274175|62.2288389|4.3733856|4.962792|44.5628941 unknown
InChI: InChI=1S/C4H6Cl2/c1-2-4(6)3-5/h2H,3H2,1H3
charge 0 multiplicity 1
12 atoms
Cl -0.269101 1.861628 0.321651
Cl 2.619754 -0.282432 0.690538
C  -0.022767 0.130069 -0.243209
C  -1.043571 -0.764032 -0.194255
C  1.352773 -0.152721 -0.737726
C  -2.45295 -0.532657 0.277059
H  -0.794806 -1.779983 -0.537365
H  1.400134 -1.126652 -1.24668
H  1.755041 0.648482 -1.372896
H  -2.622423 0.519173 0.556328
H  -3.179776 -0.814837 -0.508049
H  -2.670606 -1.167538 1.158004
