program: Gaussian 09
title: 000114658
version: EM64L-G09RevD.01
frameworkgroup: C1[X(C12H20N2O4S)]
method: RPBEPBE
basis: SDD
operation: Freq
keyword: #p
keyword: freq=noraman
keyword: PBEPBE/SDD
title: #p freq=noraman PBEPBE/SDD
converged: YES YES NO NO
title: Mulliken charges:
elementType: S O O O O N N C C C C C C C C C C C C H H H H H H H H H H H H H H H H H H H H
charge: 0.186960 -0.284209 -0.284062 -0.317866 -0.302013 -0.645259 -0.645924 -0.672067 -0.659754 -0.256076 -0.227012 0.288577 0.264666 -0.495271 -0.510419 0.451681 0.450076 -0.799028 -0.802612 0.238751 0.262678 0.227459 0.314831 0.216970 0.252024 0.225745 0.230772 0.238394 0.241248 0.233147 0.223174 0.317369 0.229711 0.226104 0.318200 0.317349 0.314955 0.316354 0.314380
chargesum: 0.00000
title: Mulliken charges with hydrogens summed into heavy atoms:
elementType: S O O O O N N C C C C C C C C C C C C
charge: 0.186960 -0.284209 -0.284062 -0.317866 -0.302013 -0.012955 -0.015190 -0.170638 -0.117464 0.212918 0.229505 0.288577 0.264666 -0.256877 -0.269171 0.451681 0.450076 -0.025338 -0.028597
polarizability: 2.10283926e+02 2.11028802e+01 2.35118751e+02 1.09406858e+01 -1.48850242e+01 1.36796604e+02
1716.lowfreq: -12.1952 -8.4803 -0.0023 -0.0019 -0.0015 4.8757 7.8273 10.2080 21.6281
frequency: 3.6911 7.2026 21.4040 27.3085 39.0591 40.7094 58.5669 70.0156 80.2361 88.6852 91.9167 119.5181 134.3282 144.3323 176.3178 199.8126 212.6589 250.9020 269.7716 274.5852 319.7474 342.9620 344.9842 383.1508 387.3229 406.2146 412.6803 435.4007 454.0948 481.2653 483.8964 484.5402 500.2729 548.1519 548.6926 608.5000 635.4333 683.8717 689.1230 695.9398 719.3677 797.2820 818.8493 844.1623 848.3332 849.3584 850.6896 898.9161 932.1864 958.5829 963.0776 997.2718 998.0817 1013.2772 1015.9523 1055.9143 1056.7016 1064.9639 1069.6793 1076.3313 1082.1991 1120.1377 1121.5595 1178.1697 1191.5226 1217.6033 1223.9943 1283.5053 1299.1894 1331.1505 1332.5717 1364.8819 1366.1447 1388.2345 1389.2917 1413.7228 1413.9278 1419.1649 1448.2091 1454.0793 1455.7519 1463.3900 1463.6049 1492.9787 1496.2603 1601.6661 1607.3842 1632.8876 1633.8276 1653.0417 1656.5919 2975.1034 2977.4396 2991.2956 2998.1978 3010.1670 3015.4052 3053.5578 3055.9051 3058.5070 3069.0107 3090.6376 3100.2824 3118.0000 3122.2412 3139.2279 3140.0830 3543.9040 3544.3112 3687.1657 3688.0984
redmass: 2.0498 3.7456 3.4374 2.1597 4.7571 3.0628 4.2482 1.6431 2.4338 3.7798 7.5815 4.3828 4.3103 5.0020 3.6573 4.1425 4.8820 3.2757 2.4412 4.7357 3.5217 3.1071 3.4812 4.8498 5.2673 1.1306 1.1357 3.0592 2.8334 2.8129 1.2993 1.2878 2.6978 1.7961 1.8019 4.0797 4.5455 5.7077 5.9077 5.6044 4.7372 2.3874 2.9776 1.5124 2.9358 1.8159 3.9017 2.7080 2.4641 2.5571 2.3180 1.8792 1.7386 1.6264 1.6563 1.5212 1.5153 2.1705 2.1390 2.7999 3.2224 1.5372 1.5725 1.1952 1.2210 1.2142 1.1760 1.2090 1.1968 1.7869 1.8332 1.6980 1.8486 1.3109 1.3099 2.1903 2.1813 1.0891 1.0933 1.1014 1.1013 1.0958 1.0884 1.0480 1.0468 9.4466 8.0616 1.5884 1.4841 2.5463 2.8703 1.0383 1.0385 1.0577 1.0580 1.0604 1.0604 1.0974 1.0975 1.1054 1.1062 1.1023 1.1047 1.0981 1.0978 1.0900 1.0900 1.0452 1.0452 1.1037 1.1038
irintensity: 1.4037 0.5924 1.0252 1.3094 1.6342 3.1447 0.6667 5.9663 5.0310 0.2536 2.1784 2.0618 6.2741 1.2097 2.9215 0.5701 0.3309 4.2077 4.0620 14.5766 4.1287 16.9249 0.4266 1.3074 3.7383 155.6535 139.9812 12.1653 3.6455 0.0454 79.0364 174.6052 7.5210 14.6680 13.3314 1.7292 3.7476 5.3412 5.9673 2.1198 7.1481 6.1114 9.6775 59.7696 19.3940 36.0861 17.0717 24.2004 29.9822 99.2017 81.2193 4.1499 28.2028 66.7774 85.2914 3.7616 2.8890 12.6766 133.2655 171.7036 523.0601 56.1525 163.7804 5.8523 0.2512 0.0925 4.4105 16.5533 8.6602 54.3007 44.4365 13.4525 12.9923 29.0360 39.4511 19.0983 97.1269 9.8948 19.3114 73.5796 80.4516 44.2401 5.3887 23.0835 19.0672 214.7705 207.7946 56.4318 61.7703 282.3375 1089.4151 53.4414 47.7551 14.8331 5.1461 113.0042 26.3990 18.5560 21.2253 19.5695 9.7977 15.8096 10.8376 4.3985 3.4213 8.5952 10.1572 60.7195 94.2350 23.2901 23.8090
temp: 298.150 k
press: 1.00000 atm
elementType: 16 8 8 8 8 7 7 6 6 6 6 6 6 6 6 6 6 6 6 1 1 1 1 1 1 1 1 1 1 1 1 1 1 1 1 1 1 1 1
symmnumber: 1
zpe: 822800.1 jmol-1
zpe.correction: 0.313388 hartree
zpe.thermalcorrener: 0.336755 hartree
zpe.thermalcorrenthalpy: 0.337699 hartree
zpe.thermalcorrgfe: 0.253150 hartree
zpe.sumelectzpe: -1276.252685 hartree
zpe.sumelectthermal: -1276.229318 hartree
zpe.sumelectthermalent: -1276.228374 hartree
zpe.sumelectthermalfe: -1276.312923 hartree
dipole: -0.8275 6.4539 -1.9156
dipole: 6.7829
quadrupole: -97.5086 -81.8290 -122.5199
quadrupole: 9.8894 -1.9518 -9.1422
quadrupole: 3.1106 18.7901 -21.9007 9.8894 -1.9518 -9.1422
hfenergy: -1276.5660731 hartree
pointgroup: C01 [X(C12H20N2O4S1)]
dipole: -0.7806442 -2.4829728 0.5888924 debye
polarizability: 200.3238705|-13.4234651|243.7432192|-20.0136879|-1.4609969|138.1321901 unknown
InChI: InChI=1S/C12H20N2O4S/c1-9(13)7-11(15)17-3-5-19-6-4-18-12(16)8-10(2)14/h7-8H,3-6,13-14H2,1-2H3
charge 0 multiplicity 1
39 atoms
S  -0.200845 1.988287 1.265477
O  -3.481169 1.851471 0.931216
O  1.915034 0.417488 -0.432577
O  -2.814643 0.81324 -1.067789
O  4.146663 0.662682 -1.08453
N  -4.851732 -2.669842 0.800964
N  4.356253 -3.568704 0.292182
C  -1.536432 3.317688 1.384081
C  0.248705 2.169048 -0.572552
C  -2.772638 3.075513 0.508864
C  1.71531 1.836689 -0.808978
C  -3.3878 0.729252 0.058497
C  3.23494 -0.074304 -0.604144
C  -4.057706 -0.402203 0.675195
C  3.291765 -1.456517 -0.154481
C  -4.195156 -1.661563 0.111437
C  4.419401 -2.262458 -0.171241
C  -3.666383 -2.068383 -1.248838
C  5.785537 -1.8346 -0.668046
H  -1.090359 4.296668 1.125431
H  -1.817366 3.330474 2.451034
H  0.076056 3.224714 -0.852728
H  -0.425055 1.519461 -1.153895
H  -3.495208 3.901095 0.647678
H  -2.509549 2.988619 -0.560249
H  1.981695 1.967936 -1.875812
H  2.387965 2.471072 -0.203255
H  -4.468127 -0.209399 1.672558
H  2.346566 -1.856419 0.229538
H  -2.894439 -2.854063 -1.139733
H  -4.482339 -2.476274 -1.875499
H  -3.216169 -1.203171 -1.75482
H  6.528601 -1.895954 0.150103
H  6.124809 -2.498409 -1.486184
H  5.746718 -0.79963 -1.036008
H  -5.235308 -2.506824 1.729714
H  -4.957277 -3.594048 0.390947
H  3.48789 -3.953458 0.658345
H  5.182291 -4.161075 0.285597
