program: Gaussian 09
title: 000114640
version: EM64L-G09RevD.01
frameworkgroup: C1[X(C11H8O2S)]
method: RPBEPBE
basis: SDD
operation: Freq
keyword: #p
keyword: freq=noraman
keyword: PBEPBE/SDD
title: #p freq=noraman PBEPBE/SDD
converged: NO YES NO NO
title: Mulliken charges:
elementType: S O O C C C C C C C C C C C H H H H H H H H
charge: 0.265619 -0.241720 -0.246216 -0.108788 0.234553 -0.121123 0.080882 -0.275774 -0.289325 -0.351153 -0.131431 -0.254919 -0.515771 -0.159945 0.276248 0.252664 0.256768 0.284966 0.250023 0.258932 0.271120 0.264392
chargesum: 0.00000
title: Mulliken charges with hydrogens summed into heavy atoms:
elementType: S O O C C C C C C C C C C C
charge: 0.265619 -0.241720 -0.246216 -0.108788 0.234553 0.155125 0.080882 -0.023110 -0.032558 -0.066188 0.118591 0.004013 -0.244651 0.104447
polarizability: 3.18332562e+02 -6.13336003e+00 1.46851850e+02 4.31390313e-02 1.87750531e-02 5.32245058e+01
1716.lowfreq: -14.5160 -5.6286 -0.5045 -0.0006 0.0014 0.0015 26.9759 50.8658 55.1621
frequency: 26.9361 50.7854 55.1594 106.6159 136.6238 153.1629 214.9390 222.8572 280.6429 291.9526 412.1951 472.6099 494.9496 562.3973 564.3884 587.4638 596.6251 671.9095 702.8569 705.7035 721.4423 746.0493 820.6282 831.4948 841.8473 842.1319 868.8678 886.5611 891.0763 906.2721 917.1348 998.9109 1005.7815 1018.6651 1042.3335 1062.4663 1085.3092 1133.1082 1142.5338 1190.9967 1235.4970 1243.9517 1296.5791 1326.3559 1355.0283 1368.9977 1451.2015 1462.4074 1518.7318 1530.0210 1564.3920 1619.8557 3102.4131 3153.8768 3173.6331 3191.4465 3226.2181 3240.4642 3245.1685 3265.6772
redmass: 6.7761 4.7799 5.7874 6.2428 3.4851 7.1290 4.2004 7.5422 6.9558 3.3345 7.2772 4.4758 6.7336 3.0756 9.2406 2.9706 5.4039 6.8211 1.2831 8.2453 3.3090 1.2643 4.8850 1.3251 1.3343 5.4198 6.3010 4.2061 1.8787 1.4571 1.3783 1.1362 1.6422 2.4807 2.1892 2.6793 1.2367 1.6003 1.7517 2.1699 2.0064 1.4184 1.4010 2.3173 2.6505 2.7986 6.3822 5.0829 11.1980 5.3894 6.8880 5.6449 1.0896 1.0914 1.0899 1.0979 1.0912 1.0997 1.0989 1.1092
irintensity: 0.2603 2.3670 0.6912 1.0544 0.1107 2.9058 0.9683 1.0426 9.0437 1.5089 1.6642 8.2641 1.7647 2.8090 24.9959 10.1866 0.0219 9.2285 102.4201 48.2779 2.8637 84.2710 10.8534 18.9175 25.5853 43.1524 9.5514 14.1119 16.4772 0.0322 0.0014 43.4483 6.9593 79.1914 7.9572 83.4175 14.8899 2.9073 23.3025 11.1451 41.9210 20.6582 8.2245 263.9424 6.3719 7.9368 144.5529 82.3230 231.3278 5.5912 145.1109 314.6653 0.0054 7.1069 4.3064 5.3721 3.0683 0.7377 0.9571 0.5897
temp: 298.150 k
press: 1.00000 atm
elementType: 16 8 8 6 6 6 6 6 6 6 6 6 6 6 1 1 1 1 1 1 1 1
symmnumber: 1
zpe: 411732.5 jmol-1
zpe.correction: 0.156821 hartree
zpe.thermalcorrener: 0.169071 hartree
zpe.thermalcorrenthalpy: 0.170015 hartree
zpe.thermalcorrgfe: 0.116005 hartree
zpe.sumelectzpe: -971.448431 hartree
zpe.sumelectthermal: -971.436180 hartree
zpe.sumelectthermalent: -971.435236 hartree
zpe.sumelectthermalfe: -971.489246 hartree
dipole: -0.1506 4.0236 0.0004
dipole: 4.0264
quadrupole: -58.8792 -86.8240 -93.5621
quadrupole: 2.8505 0.0007 0.0164
quadrupole: 20.8759 -7.0689 -13.8070 2.8505 0.0007 0.0164
hfenergy: -971.6052511 hartree
pointgroup: C01 [X(C11H8O2S1)]
dipole: -0.1221819 1.579375 0.0033255 debye
dipolederiv: 0.1924105 -0.0117303 -0.0003091 -0.0740127 -0.2648872 -0.0018508 -0.0012877 -0.001674 0.1444139 -0.5072364 0.2395525 -0.0004139 0.3510376 -0.3173543 0.0002163 -0.000021 0.0003562 -0.1153428 -0.8866735 -0.0102362 0.0003052 0.3369737 -0.9934765 -0.0011112 0.000515 0.0001706 -0.3406065 -0.2755494 0.3224577 0.0017309 0.8611243 0.0716465 0.001033 0.0034156 0.0013089 -0.1573839 -0.9450044 -0.5125277 0.0002547 -0.3153533 0.098792 -0.0003519 0.0000399 -0.000265 -0.0126757 1.2454472 -0.2055107 -0.0014816 -0.1525005 0.1205511 0.000121 -0.0013562 0.000209 -0.0326338 2.7241871 0.1437648 -0.0013407 -0.3796014 0.9996885 0.0013534 -0.0018552 0.0001966 0.2055715 -1.8533502 0.2786818 0.0014055 0.0156401 0.0066989 0.0001836 -0.000169 0.0001249 -0.2008841 0.2808969 0.0146021 0.0003754 -0.3932108 -0.1320819 0.0002473 -0.0005118 0.0000448 -0.1302134 0.3610731 0.1987717 -0.0000719 0.1197359 0.1041475 -0.0000343 0.0000529 -0.0000373 -0.1395945 -0.5090005 -0.1080898 -0.0003677 -0.3905128 -0.0471749 0.00048 -0.0026512 0.0004895 -0.1382945 0.0416151 0.0516265 0.0002302 -0.3631156 -0.2731979 0.0002179 0.0004073 0.000122 -0.2061376 -0.3193701 -0.0874816 -0.0000682 0.4846865 0.2758664 0.0025079 0.0024456 0.0026954 -0.3081085 -0.0922806 -0.2606241 0.0006213 -0.1268382 0.1481365 -0.0001784 -0.0001748 -0.0004299 -0.1078757 0.1215155 -0.0037714 -0.0000587 -0.0040931 0.0068067 -0.0002347 0.0009206 -0.0004232 0.153721 0.1053632 0.0138845 0.0001313 0.0458045 -0.0506786 -0.0001528 0.0004476 -0.0003375 0.1699472 0.0471724 -0.0796389 -0.0005819 -0.0973067 0.0281595 -0.0008779 -0.0004653 -0.000853 0.1890975 0.1596868 0.002793 -0.0000807 0.0163448 0.0323775 0.0000766 -0.0000527 0.0000327 0.1930274 0.0607844 0.0427139 0.0001524 0.0992006 -0.0441209 -0.0011288 0.0002279 -0.0011659 0.1957415 -0.0499646 -0.0274859 -0.0001699 -0.0306459 0.1268527 0.0000186 -0.0001471 0.0000227 0.2012018 0.012854 -0.0038313 -0.0001894 0.0156838 0.0894712 -0.0006211 0.0003235 -0.000676 0.2213264 0.0854235 0.0020794 -0.000073 -0.0190408 0.0137771 0.0000865 -0.000104 0.0000885 0.2157028 unknown
polarizability: 318.5487737|0.7011492|146.6351725|-0.0860486|0.2045173|53.2249713 unknown
InChI: InChI=1S/C11H8O2S/c12-10(11-4-1-7-13-11)6-5-9-3-2-8-14-9/h1-8H
charge 0 multiplicity 1
22 atoms
S  -4.015449 -1.193798 -0.004145
O  2.491271 1.22071 -0.002861
O  1.283691 -2.232376 -0.00258
C  -2.513818 -0.167474 0.001273
C  2.521386 -0.201417 -0.002406
C  -1.219291 -0.807891 -0.000894
C  1.25204 -0.953379 -0.002884
C  -0.001583 -0.168515 -0.001047
C  -2.863312 1.190246 0.007518
C  3.848264 -0.624226 -0.001292
C  -4.274637 1.432424 0.007822
C  4.677933 0.552282 -0.000884
C  -5.03772 0.268602 0.00186
C  3.823416 1.647432 -0.001986
H  -1.183655 -1.90715 -0.002699
H  0.084991 0.922819 -0.000328
H  -2.116975 1.988011 0.012252
H  4.16414 -1.664805 -0.000816
H  -4.717352 2.430936 0.012401
H  5.765223 0.588424 0.000048
H  -6.120774 0.161046 0.000538
H  3.975409 2.723495 -0.002388
