program: Gaussian 09
title: 000114601
version: EM64L-G09RevD.01
frameworkgroup: C1[X(C16H30O2)]
method: RPBEPBE
basis: SDD
operation: Freq
keyword: #pfreq=noraman
keyword: PBEPBE/SDD
title: #p freq=noraman PBEPBE/SDD
converged: YES YES NO NO
title: Mulliken charges:
elementType: O O C C C C C C C C C C C C C C C C H H H H H H H H H H H H H H H H H H H H H H H H H H H H H H
charge: -0.266732 -0.247765 -0.034034 -0.409843 -0.393309 -0.366913 -0.291528 -0.472790 -0.516890 -0.709701 -0.710306 -0.469783 -0.354780 -0.188545 0.257229 -0.164913 -0.351021 -0.683176 0.205787 0.213457 0.213192 0.197229 0.205336 0.240706 0.203279 0.237887 0.236775 0.202409 0.203378 0.238903 0.235258 0.215225 0.211246 0.214639 0.215144 0.214414 0.212196 0.201738 0.198708 0.191091 0.185871 0.224544 0.211212 0.180040 0.241861 0.205843 0.195374 0.222056
chargesum: 0.00000
title: Mulliken charges with hydrogens summed into heavy atoms:
elementType: O O C C C C C C C C C C C C C C C C
charge: -0.266732 -0.247765 0.171753 0.016806 0.009255 0.077073 0.183135 -0.067003 -0.042730 -0.068591 -0.068552 -0.069337 0.022182 0.035999 0.257229 0.046300 0.070880 -0.059903
polarizability: 2.06810728e+02 -4.08070410e+00 1.91607007e+02 -1.92477302e-01 -4.54408730e+00 1.48640428e+02
1716.lowfreq: -22.5249 -13.3052 -8.6771 -0.0005 -0.0003 0.0003 0.7995 10.1818 17.6225
frequency: -19.7134 -6.6876 16.9883 27.1052 33.5427 42.4727 48.7944 78.0806 84.5836 95.0704 101.7951 120.8713 148.5300 171.1290 198.6103 215.2449 220.1756 227.7838 236.0863 240.5480 243.5505 272.4658 302.3550 325.2589 354.4016 357.6723 374.9317 417.3536 440.9298 478.3601 496.6117 543.7620 596.5487 695.9129 730.7643 741.4999 769.0514 774.9856 787.8799 815.9329 837.3318 853.6103 858.5434 877.8618 909.3401 912.4650 927.8410 944.9941 949.6158 966.9983 972.3670 976.7296 985.4151 1003.8050 1022.5050 1030.3250 1045.2466 1061.2614 1077.3978 1099.9521 1114.4970 1118.3901 1132.0403 1139.2201 1149.9819 1178.0602 1185.4418 1192.9677 1208.1946 1209.6360 1230.3324 1238.7910 1269.5667 1277.8864 1283.2966 1283.4478 1286.4451 1293.3569 1299.3443 1300.5115 1317.3137 1331.7566 1337.5992 1340.7197 1347.1510 1352.4015 1356.4173 1377.6273 1380.5499 1388.7221 1395.5514 1449.0147 1456.0647 1462.4369 1462.5320 1464.7195 1465.4448 1471.6111 1473.2492 1473.5083 1477.2491 1478.0698 1483.4235 1485.9233 1487.7932 1490.8454 1628.8722 1684.1646 2948.8680 2959.2948 2959.3775 2965.5497 2969.3437 2970.0948 2970.6864 2970.8861 2974.2574 2989.5970 2989.8873 2999.6006 3002.6155 3012.2110 3013.0651 3018.0657 3029.8447 3035.5258 3039.1750 3049.0823 3053.5699 3064.1842 3066.3490 3066.7643 3068.0822 3071.2112 3072.6451 3076.6374 3079.0724 3083.0483
redmass: 3.2568 2.8045 3.8095 4.1910 5.1682 3.7397 3.3600 1.9668 2.3866 1.9452 2.9695 3.4968 2.6741 2.4428 2.7425 1.4680 1.3465 1.4401 1.3495 1.5868 2.6167 2.4934 4.5356 3.0415 2.1013 2.2481 2.1328 3.0507 2.9457 2.6355 2.0020 2.5395 3.5817 6.3899 1.1912 1.2346 1.4718 1.1568 3.0489 2.0670 1.5677 1.5834 3.3087 3.0331 1.9828 1.1967 2.1970 2.0838 1.2748 1.9871 1.4675 1.3770 1.7626 2.0179 2.0198 2.2973 1.7962 2.1611 2.2914 2.0405 2.6367 1.9336 1.6742 1.9644 1.7915 1.6222 1.6415 1.9130 1.3326 1.2117 1.3468 1.2689 1.2828 1.1324 1.4816 1.2293 1.1830 1.2364 1.2332 1.3223 1.3472 1.4726 1.3698 1.4219 1.4046 1.5359 1.4762 1.2098 1.4892 1.2146 1.2233 1.0878 1.0947 1.0845 1.0827 1.0785 1.0461 1.0938 1.0451 1.0886 1.0445 1.0550 1.0739 1.0552 1.0912 1.0568 10.0081 6.5991 1.0600 1.0613 1.0607 1.0800 1.0634 1.0431 1.0549 1.0354 1.0362 1.0634 1.0633 1.0616 1.0975 1.0568 1.0989 1.0968 1.0984 1.0993 1.1021 1.0989 1.0933 1.1000 1.0981 1.1003 1.0913 1.0990 1.0985 1.0987 1.1002 1.1078
irintensity: 0.0587 0.2151 0.0985 0.2860 0.8142 0.3167 0.1754 0.4110 0.4152 0.3183 0.8642 0.9723 0.5267 1.9519 0.6489 1.8622 0.4031 1.3649 0.7914 2.2476 0.9277 2.5216 14.7164 2.9939 0.1400 0.6492 1.8380 1.6847 0.5170 0.3325 0.9420 7.3031 4.6077 3.9914 19.9351 6.8307 3.8590 2.0876 0.3036 1.4970 2.7118 1.9195 5.6506 5.3860 13.3937 2.5801 18.8580 34.4388 0.4519 6.6343 48.7812 34.1085 0.0744 7.6364 24.4486 19.9160 13.8857 18.9341 32.3704 15.3134 34.0796 142.7312 1.9304 0.3702 6.9262 21.3865 139.9862 5.9136 5.1772 2.3551 1.3268 5.6260 5.8439 0.4632 1.9848 1.0582 16.8540 20.8106 20.8607 32.3321 13.0710 1.8806 0.2412 1.1320 3.0963 0.4182 18.8085 22.0279 1.0274 11.2963 13.7064 9.2447 14.2973 6.6544 7.1161 3.3541 1.5089 1.6044 4.0108 31.6646 14.2559 2.7029 19.5437 5.4481 10.5012 16.1409 189.4523 0.3214 23.7449 29.4009 32.0879 17.7865 47.0619 104.1135 10.4884 43.4434 19.6192 13.1997 33.6013 20.2374 26.6857 19.9261 19.7473 31.3334 51.0006 10.9347 8.1023 14.1713 11.4739 13.0707 33.6166 17.4746 156.1841 55.4247 109.2856 42.1441 31.9450 45.1447
temp: 298.150 k
press: 1.00000 atm
elementType: 8 8 6 6 6 6 6 6 6 6 6 6 6 6 6 6 6 6 1 1 1 1 1 1 1 1 1 1 1 1 1 1 1 1 1 1 1 1 1 1 1 1 1 1 1 1 1 1
symmnumber: 1
zpe: 1121032.4 jmol-1
zpe.correction: 0.426979 hartree
zpe.thermalcorrener: 0.448491 hartree
zpe.thermalcorrenthalpy: 0.449435 hartree
zpe.thermalcorrgfe: 0.373847 hartree
zpe.sumelectzpe: -776.661942 hartree
zpe.sumelectthermal: -776.640430 hartree
zpe.sumelectthermalent: -776.639486 hartree
zpe.sumelectthermalfe: -776.715074 hartree
dipole: -1.4699 -1.4064 -0.5443
dipole: 2.1059
quadrupole: -103.6342 -113.7160 -112.7553
quadrupole: -1.7524 1.6987 -2.4828
quadrupole: 6.4010 -3.6808 -2.7202 -1.7524 1.6987 -2.4828
hfenergy: -777.0889209 hartree
pointgroup: C01 [X(C16H30O2)]
dipole: -0.5711857 -0.504361 -0.3253155 debye
polarizability: 206.8222862|-4.0564464|191.7964687|0.3758157|3.4483078|148.4394077 unknown
InChI: InChI=1S/C16H30O2/c1-4-5-6-7-8-9-10-11-12-16(17)18-14-13-15(2)3/h7-8,15H,4-6,9-14H2,1-3H3
charge 0 multiplicity 1
48 atoms
O  -1.98465 -0.891986 -0.566138
O  -0.495854 0.485441 0.579966
C  -5.670306 0.235088 -0.462806
C  -4.375125 -0.567639 -0.780937
C  2.411188 -2.91041 0.104434
C  1.273316 -1.971083 0.56749
C  -3.100908 0.025731 -0.174869
C  3.430433 -2.258498 -0.875807
C  0.33954 -1.527151 -0.587597
C  -5.995567 0.258829 1.051512
C  -5.63528 1.669598 -1.045851
C  4.763282 1.433232 -0.228124
C  3.781591 2.614664 0.016131
C  4.118087 -1.042087 -0.288416
C  -0.709139 -0.535394 -0.117771
C  4.092361 0.20943 -0.817465
C  2.714717 2.32892 1.097036
C  1.774017 3.528592 1.338379
H  -6.494865 -0.308743 -0.969632
H  -4.244739 -0.630229 -1.878901
H  -4.488513 -1.605037 -0.410571
H  1.981283 -3.815136 -0.372324
H  2.960785 -3.260737 1.001725
H  1.702181 -1.068738 1.041091
H  0.66959 -2.485346 1.340844
H  -3.131909 0.076309 0.928073
H  -2.8698 1.03428 -0.561154
H  2.930209 -1.981644 -1.824434
H  4.187287 -3.027214 -1.137467
H  -0.158091 -2.392143 -1.058215
H  0.940769 -1.0206 -1.367757
H  -6.003329 -0.762046 1.477646
H  -5.257649 0.858104 1.617249
H  -6.990039 0.707973 1.230357
H  -5.392382 1.659145 -2.125005
H  -6.616109 2.165247 -0.923427
H  -4.882725 2.297986 -0.53363
H  5.560215 1.780256 -0.919958
H  5.262497 1.163282 0.723916
H  4.367584 3.510839 0.307747
H  3.275308 2.870916 -0.938501
H  4.663235 -1.205752 0.656074
H  3.537096 0.375446 -1.756694
H  3.224906 2.058517 2.045123
H  2.107326 1.450917 0.805696
H  1.240855 3.801762 0.408098
H  2.335123 4.419385 1.681484
H  1.009997 3.287225 2.099083
