program: Gaussian 09
title: 000114596
version: EM64L-G09RevD.01
frameworkgroup: C1[X(C6H6O)]
method: RPBEPBE
basis: SDD
operation: Freq
keyword: #p
keyword: freq=noraman
keyword: PBEPBE/SDD
title: #p freq=noraman PBEPBE/SDD
converged: NO YES NO NO
title: Mulliken charges:
elementType: O C C C C C C H H H H H H
charge: -0.389825 0.443163 -0.417906 -0.386753 -0.256819 -0.253989 -0.304923 0.239826 0.258781 0.233805 0.233258 0.226157 0.375226
chargesum: 0.00000
title: Mulliken charges with hydrogens summed into heavy atoms:
elementType: O C C C C C C
charge: -0.014600 0.443163 -0.178080 -0.127972 -0.023015 -0.020731 -0.078766
polarizability: 1.13688431e+02 5.37591170e+00 6.53202487e+01 -4.29126292e-04 1.72141198e-03 2.66113926e+01
1716.lowfreq: -13.9172 -5.8167 -0.0008 -0.0003 0.0002 17.5767 154.8275 186.0110 279.3335
frequency: 154.8257 186.0091 279.3311 409.9921 474.0614 568.8953 628.5494 698.9631 722.9030 775.5992 810.4263 876.3618 901.3448 904.6446 919.9091 1002.6105 1072.1049 1080.3407 1125.7020 1167.7353 1236.4867 1293.1099 1344.9795 1396.4732 1476.7163 1539.7800 1690.8471 3098.4639 3166.4224 3177.7030 3198.4769 3216.6292 3600.4089
redmass: 4.7715 4.3073 2.0106 1.2682 6.0426 2.8986 2.1350 4.0187 1.3072 1.5217 5.9528 1.4536 2.8113 1.3404 1.3638 2.6338 1.2130 1.1112 3.1536 1.6072 1.4815 1.7558 2.0329 1.7753 5.7520 4.9119 6.2812 1.0927 1.0871 1.0919 1.1030 1.1071 1.0671
irintensity: 1.5138 3.9044 112.1063 82.5477 6.6138 4.9356 35.7806 14.9816 8.7741 96.7615 0.9904 31.2613 29.0405 4.8505 0.3914 10.2938 22.7174 24.1302 284.6930 15.0643 61.5006 21.3454 14.8298 14.1899 24.5299 0.3163 192.5128 14.5969 2.7577 12.2856 16.1348 9.8807 93.0969
temp: 298.150 k
press: 1.00000 atm
elementType: 8 6 6 6 6 6 6 1 1 1 1 1 1
symmnumber: 1
zpe: 264355.6 jmol-1
zpe.correction: 0.100688 hartree
zpe.thermalcorrener: 0.106833 hartree
zpe.thermalcorrenthalpy: 0.107777 hartree
zpe.thermalcorrgfe: 0.070868 hartree
zpe.sumelectzpe: -306.899430 hartree
zpe.sumelectthermal: -306.893285 hartree
zpe.sumelectthermalent: -306.892341 hartree
zpe.sumelectthermalfe: -306.929250 hartree
dipole: 2.9614 1.7611 0.0002
dipole: 3.4455
quadrupole: -26.7845 -37.7734 -45.7917
quadrupole: 4.9269 0.0007 0.0003
quadrupole: 9.9987 -0.9902 -9.0085 4.9269 0.0007 0.0003
hfenergy: -307.0001179 hartree
pointgroup: C01 [X(C6H6O1)]
dipole: 1.1532493 0.7124044 0.0000984 debye
dipolederiv: -1.4038244 0.2062133 0.0000329 1.0466821 -0.2818756 0.0000259 0.000089 0.0000303 -0.4137132 -0.8552712 -0.0494313 0.0000188 -0.1995875 -0.0191592 -0.0000054 -0.000027 -0.0000035 0.031607 0.5066482 -0.0079013 -0.0000183 -0.0834521 -0.1638251 0.000015 -0.0000387 -0.0000085 -0.3044639 0.2530838 0.1574635 -0.0000083 0.3045526 -0.0846475 0.0000036 -0.0000012 0.0000169 -0.2472308 -0.1689926 -0.100235 -0.0000052 -0.5764232 -0.023655 0.0000212 -0.0000073 0.0000036 -0.2011766 -0.3741733 -0.0173359 0.0000028 0.3803074 0.1946222 -0.0000009 0.0000119 0.0000105 -0.1968242 1.6275777 -0.0999557 -0.0000143 -0.7558955 0.3406758 0.0000106 -0.0000037 0.0000149 -0.0645183 0.0828026 -0.0351521 -0.0000013 0.0198477 -0.0904859 -0.0000168 0.0000038 -0.000006 0.2024863 0.0675611 0.0751055 0.0000106 0.0313819 -0.0226539 -0.0000099 0.0000082 -0.0000146 0.2006711 -0.0915621 0.081754 0.0000031 0.0791566 0.06065 -0.0000057 0.0000177 0. 0.1919375 0.0005723 -0.1084447 0.0000017 -0.1073381 -0.0353033 0.0000012 -0.000011 -0.0000018 0.1844207 0.0200051 -0.0128531 -0.0000017 -0.017408 -0.1021535 -0.0000131 0.0000043 -0.0000177 0.2033825 0.3355728 -0.0892272 -0.0000206 -0.121824 0.2278111 -0.0000256 -0.000046 -0.0000241 0.413422 unknown
polarizability: 113.4935435|6.1877956|65.5151365|-0.0004581|0.0017139|26.6113926 unknown
InChI: InChI=1S/C6H6O/c7-5-6-3-1-2-4-6/h1-5,7H
charge 0 multiplicity 1
13 atoms
O  2.662136 -0.356038 -0.000021
C  0.325704 0.235959 -0.00001
C  -0.801431 1.192253 0.000106
C  -0.248002 -1.121142 -0.00002
C  -1.971794 0.452843 0.000048
C  -1.62694 -0.984704 0.000033
C  1.648034 0.597471 0.000012
H  -0.703448 2.279995 0.000172
H  0.335478 -2.042118 -0.000082
H  -2.988539 0.852516 0.000064
H  -2.355584 -1.799137 0.000044
H  1.954519 1.654562 0.000073
H  3.559469 0.057738 0.000083
