program: Gaussian 09
title: 000114563
version: EM64L-G09RevD.01
frameworkgroup: C1[X(C14H18O5)]
method: RPBEPBE
basis: SDD
operation: Freq
keyword: #pfreq=noraman
keyword: PBEPBE/SDD
title: #p freq=noraman PBEPBE/SDD
converged: YES YES NO NO
title: Mulliken charges:
elementType: O O O O O C C C C C C C C C C C C C C H H H H H H H H H H H H H H H H H H
charge: -0.290407 -0.254421 -0.257945 -0.255559 -0.243858 -0.037297 -0.285783 -0.311516 -0.335773 0.391229 -0.401310 -0.391006 0.293254 -0.215706 -0.225672 0.298380 -0.240889 -0.756669 -0.756474 0.255152 0.197404 0.242292 0.231987 0.271463 0.206982 0.205614 0.269843 0.225883 0.225892 0.225454 0.227768 0.244752 0.250983 0.251226 0.249351 0.249070 0.246305
chargesum: 0.00000
title: Mulliken charges with hydrogens summed into heavy atoms:
elementType: O O O O O C C C C C C C C C C C C C C
charge: -0.290407 -0.254421 -0.257945 -0.255559 -0.243858 0.217855 0.153913 0.191935 0.076823 0.391229 -0.131468 -0.165123 0.293254 0.010185 -0.000217 0.298380 -0.013121 -0.009708 -0.011749
polarizability: 1.95617198e+02 1.36624280e+01 1.45596168e+02 3.58122224e+00 -1.69434163e+01 1.50273398e+02
1716.lowfreq: -9.0846 -4.7719 -0.0003 -0.0001 0.0002 3.9911 4.8067 12.1323 19.3567
frequency: -6.8918 11.6734 19.2707 21.0005 28.1845 33.6501 38.8107 52.2911 63.6530 93.3648 107.4847 143.9691 169.4896 189.0106 192.4008 210.2393 238.6613 280.0401 299.3680 371.6525 401.7836 412.2312 435.1967 437.0038 464.3124 563.9665 565.7663 582.6850 596.7328 615.8534 626.6510 665.5671 702.3008 739.6561 770.9732 806.6851 843.1465 856.7614 883.1427 909.5969 918.2489 924.4740 968.9089 979.4167 989.4557 994.2763 995.8767 1008.5479 1011.7541 1015.7708 1028.2227 1042.5316 1044.5461 1052.7927 1079.4456 1091.1674 1141.3791 1171.6763 1184.7119 1195.1354 1199.3910 1209.0673 1212.6558 1215.5374 1218.3864 1285.8774 1309.2699 1337.1517 1342.0294 1373.9249 1382.0782 1384.2713 1386.7112 1401.6860 1440.1120 1450.4214 1452.8064 1453.7850 1454.4519 1457.0537 1464.1896 1481.4808 1486.6572 1595.5330 1618.9191 1646.2143 1650.7893 2903.2583 2928.0892 2947.3350 2996.0322 3006.3079 3008.6125 3032.1727 3041.2691 3096.6983 3100.2137 3110.1132 3111.9445 3126.4856 3139.8555 3140.2784 3143.8629 3158.0921 3172.8004
redmass: 1.5410 2.5077 2.3527 3.1889 2.0973 2.7255 4.1867 3.7976 3.8523 3.7151 4.5740 3.6262 4.4654 6.9999 3.9873 3.2964 3.4749 4.6301 2.7239 4.2098 2.8355 3.2983 2.9202 3.8661 2.8664 3.1920 3.1636 5.1067 4.9211 6.3567 4.1687 4.8720 2.2748 1.3831 3.4479 4.1436 5.9493 1.2506 3.9096 1.3374 5.5292 1.8845 3.1557 1.3800 6.0633 1.6627 1.4916 2.2512 3.7011 1.8313 2.1616 1.6733 1.6580 2.5554 1.9742 2.5991 1.8345 1.0545 1.1132 2.4150 1.2679 1.1821 3.2562 1.2225 2.1525 1.4306 1.4054 1.3158 1.2721 1.7217 2.7420 1.2538 1.4194 1.7952 2.1199 1.0725 1.0638 1.0474 1.0613 1.0555 1.0890 1.1519 2.0595 6.1819 6.0584 9.1538 9.8981 1.0563 1.0610 1.1027 1.0996 1.0384 1.0368 1.0610 1.0847 1.0973 1.0939 1.0878 1.1037 1.0866 1.1025 1.0928 1.1010 1.0978 1.0971
irintensity: 1.0960 0.5797 0.6662 0.5968 0.2115 0.7756 1.9804 1.5902 1.8202 2.2645 5.6244 16.0272 4.6536 3.5948 2.5073 1.6127 5.1658 1.2143 1.8861 3.9037 0.1927 5.5660 0.8686 25.3978 8.0393 4.4889 3.0256 0.7981 3.9935 0.8522 1.8495 15.3597 27.6361 81.7964 13.6004 2.1427 10.2042 0.1124 11.8243 1.7904 79.2186 3.1810 12.4574 0.0539 0.0179 55.2118 28.9337 65.3428 107.7912 22.4064 10.2698 16.3498 12.7089 90.0575 12.5625 55.7380 25.4035 0.4031 4.9302 434.5410 82.9946 5.9784 224.3665 10.5658 6.0354 6.8852 14.9466 1.3205 25.2766 2.6068 4.3016 43.2061 66.3290 0.9086 13.0884 9.7886 24.5647 17.9900 25.9136 15.1912 17.0408 10.2748 11.1876 1.3074 5.7580 232.7225 139.7515 42.8732 66.0827 46.8637 32.9951 2.4274 1.7952 18.5316 10.4583 6.9073 8.9846 10.7647 11.3049 1.1747 8.6519 31.0192 10.5904 31.9462 7.6055
temp: 298.150 k
press: 1.00000 atm
elementType: 8 8 8 8 8 6 6 6 6 6 6 6 6 6 6 6 6 6 6 1 1 1 1 1 1 1 1 1 1 1 1 1 1 1 1 1 1
symmnumber: 1
zpe: 773723.3 jmol-1
zpe.correction: 0.294696 hartree
zpe.thermalcorrener: 0.314642 hartree
zpe.thermalcorrenthalpy: 0.315586 hartree
zpe.thermalcorrgfe: 0.239614 hartree
zpe.sumelectzpe: -918.959597 hartree
zpe.sumelectthermal: -918.939651 hartree
zpe.sumelectthermalent: -918.938706 hartree
zpe.sumelectthermalfe: -919.014679 hartree
dipole: -0.0776 1.4092 -0.1551
dipole: 1.4198
quadrupole: -96.8133 -126.9881 -100.0479
quadrupole: -5.2905 7.8369 3.0176
quadrupole: 11.1365 -19.0383 7.9018 -5.2905 7.8369 3.0176
hfenergy: -919.2542928 hartree
pointgroup: C01 [X(C14H18O5)]
dipole: 0.0769521 -0.5527959 -0.0230609 debye
polarizability: 192.447556|17.8530293|150.7240166|-7.8338347|15.9400932|148.315192 unknown
InChI: InChI=1S/C14H18O5/c1-11(15)18-10-14(19-12(2)16)9-17-8-13-6-4-3-5-7-13/h3-7,14H,8-10H2,1-2H3
charge 0 multiplicity 1
37 atoms
O  0.791851 -0.346707 -0.748865
O  -1.626127 -1.404261 0.683383
O  -3.280993 0.814797 -0.271984
O  -2.241277 -3.477377 -0.194233
O  -2.940606 3.109481 -0.056807
C  -1.586128 -0.842252 -0.70134
C  -0.248509 -1.159613 -1.37558
C  -1.829646 0.653758 -0.559405
C  2.116724 -0.618333 -1.309427
C  3.165089 0.172779 -0.547176
C  2.885861 0.732997 0.722144
C  4.459029 0.328897 -1.10487
C  -1.991077 -2.752021 0.796238
C  3.89068 1.437852 1.424256
C  5.463973 1.027167 -0.400208
C  -3.709539 2.123439 -0.013511
C  5.182384 1.584961 0.869016
C  -2.030349 -3.164121 2.250038
C  -5.181079 2.143496 0.337575
H  -2.393176 -1.321534 -1.28588
H  -0.326686 -0.919722 -2.460702
H  -0.02608 -2.242259 -1.276599
H  -1.582374 1.187816 -1.494205
H  -1.232993 1.088069 0.257885
H  2.329156 -1.710282 -1.235504
H  2.136968 -0.347634 -2.389184
H  1.882105 0.618926 1.141199
H  4.683561 -0.09268 -2.093496
H  3.663411 1.873183 2.404079
H  6.460373 1.141674 -0.841868
H  5.95945 2.131592 1.415025
H  -2.295775 -4.228042 2.327677
H  -1.048638 -2.986208 2.721887
H  -2.77077 -2.553821 2.795608
H  -5.295758 2.02682 1.430958
H  -5.717328 1.31612 -0.15168
H  -5.617007 3.112243 0.049653
