program: Gaussian 09
title: 000015034
version: EM64L-G09RevD.01
frameworkgroup: C1[X(C6H3Br2F)]
method: RPBEPBE
basis: SDD
operation: Freq
keyword: #p
keyword: freq=noraman
keyword: PBEPBE/SDD
title: #p freq=noraman PBEPBE/SDD
converged: NO YES YES YES
title: Mulliken charges:
elementType: Br Br F C C C C C C H H H
charge: 0.079751 0.038437 -0.176408 -0.380271 -0.124086 0.442715 -0.219547 -0.322286 -0.147627 0.277690 0.270487 0.261144
chargesum: 0.00000
title: Mulliken charges with hydrogens summed into heavy atoms:
elementType: Br Br F C C C C C C
charge: 0.079751 0.038437 -0.176408 -0.380271 0.153604 0.442715 -0.219547 -0.051799 0.113518
polarizability: 1.46871327e+02 -2.60530814e+00 9.71105153e+01 -2.70208904e-04 9.00281520e-04 3.19535986e+01
1716.lowfreq: -6.2276 -0.0004 0.0004 0.0005 5.3749 8.8931 105.5713 121.3438 143.3623
frequency: 105.5707 121.3432 143.3599 205.6785 265.1843 317.2675 317.4110 437.1438 459.3254 543.9365 591.9977 658.0089 693.4740 800.3869 812.5952 874.1343 941.5140 1017.4266 1064.6156 1132.7254 1211.1875 1243.2796 1357.0082 1368.6696 1447.7053 1576.0198 1578.4150 3169.4149 3183.8770 3189.1602
redmass: 10.2262 26.0222 5.3576 17.7218 15.5711 8.0187 9.8196 3.2109 6.1302 4.3394 9.6241 8.0672 3.9782 7.4064 1.4076 1.3972 1.3410 5.7074 2.2767 1.3552 3.0203 1.3458 4.0787 6.8115 2.6680 7.2127 8.8262 1.0891 1.0934 1.0976
irintensity: 0.9243 0.0318 1.0469 0.4943 1.1616 0.2896 0.9564 10.0888 6.3678 7.6407 38.3974 31.8257 2.9974 10.5755 53.3587 17.0513 0.7620 49.2590 24.3809 1.3544 46.3091 10.0980 8.6512 5.9696 204.5596 20.4448 3.4414 0.6740 0.1128 0.7500
temp: 298.150 k
press: 1.00000 atm
elementType: 35 35 9 6 6 6 6 6 6 1 1 1
symmnumber: 1
zpe: 184391.4 jmol-1
zpe.correction: 0.070231 hartree
zpe.thermalcorrener: 0.078492 hartree
zpe.thermalcorrenthalpy: 0.079436 hartree
zpe.thermalcorrgfe: 0.034541 hartree
zpe.sumelectzpe: -356.550460 hartree
zpe.sumelectthermal: -356.542200 hartree
zpe.sumelectthermalent: -356.541256 hartree
zpe.sumelectthermalfe: -356.586150 hartree
dipole: -1.3327 0.7581 0.0001
dipole: 1.5333
quadrupole: -74.4561 -62.4657 -72.2512
quadrupole: -4.9545 0.0001 0.0004
quadrupole: -4.7317 7.2586 -2.5269 -4.9545 0.0001 0.0004
hfenergy: -356.6206914 hartree
pointgroup: C01 [X(C6H3Br2F1)]
dipole: -0.4717839 0.3759095 -0.0000726 debye
dipolederiv: -0.3571449 0.2571122 -0.0000724 0.3464751 -0.2690212 0.0000787 -0.0000999 0.0000817 0.0237581 -0.6516475 -0.1158641 0.0000162 -0.1679441 -0.0892724 0.000013 0.0000297 0.0000113 -0.0142664 -0.954329 -0.3256565 0.0000895 -0.2687465 -0.2770305 0.0000376 0.0000681 0.0000373 -0.1284537 0.588085 -0.5423792 0.0001675 -0.6617629 0.446639 -0.0001582 0.0002025 -0.0001709 -0.144678 -0.5180037 0.0776806 -0.0000363 0.0985514 -0.1047388 0.0000289 -0.0000387 0.0000366 -0.0184721 0.8585769 0.5701333 -0.0001635 0.3918915 0.1693532 -0.0000083 -0.0001232 -0.0000013 0.1358081 1.1875465 0.2764613 -0.0000396 0.3090658 0.0897032 -0.0000437 -0.0000465 -0.0000425 -0.138465 -0.0305745 -0.1351134 0.0000339 0.0571665 -0.0198895 -0.0000251 -0.0000094 -0.0000274 -0.1399018 -0.3048941 -0.0873391 0.0000117 -0.1178541 0.0007367 -0.0000183 0.0000199 -0.0000275 -0.0918633 0.101341 -0.020308 0.0000024 -0.0206749 0.0174867 0.0000286 0. 0.0000305 0.162161 0.0514846 -0.0235444 0.0000052 -0.0292547 -0.0083839 0.0000416 0.0000151 0.0000432 0.1870988 0.0295596 0.0688172 -0.0000146 0.0630868 0.0444174 0.0000251 -0.0000175 0.000029 0.1672744 unknown
polarizability: 144.8794|-10.0965208|99.1024387|0.0040004|-0.0149753|31.953602 unknown
InChI: InChI=1S/C6H3Br2F/c7-4-1-2-6(9)5(8)3-4/h1-3H
charge 0 multiplicity 1
12 atoms
Br 2.217239 -2.052457 0.000502
Br -3.426641 -0.658798 0.000064
F  2.471775 1.058644 -0.000303
C  0.807832 -0.713618 0.000115
C  -0.547672 -1.108361 0.000173
C  1.131807 0.65893 -0.000191
C  -1.546306 -0.110949 -0.00003
C  0.132677 1.647732 -0.000374
C  -1.225517 1.26319 -0.000288
H  -0.810714 -2.168542 0.000374
H  0.423771 2.701985 -0.000596
H  -2.01265 2.021047 -0.000446
