program: Gaussian 09
title: 000114535
version: EM64L-G09RevD.01
frameworkgroup: C1[X(C7H10O2)]
method: RPBEPBE
basis: SDD
operation: Freq
keyword: #pfreq=noraman
keyword: PBEPBE/SDD
title: #p freq=noraman PBEPBE/SDD
converged: YES YES NO NO
title: Mulliken charges:
elementType: O O C C C C C C C H H H H H H H H H H
charge: -0.137940 -0.134485 -0.115319 -0.470917 -0.512222 -0.391136 0.052860 0.082741 -0.701189 0.247029 0.243152 0.223562 0.248199 0.260377 0.237417 0.209615 0.210319 0.221642 0.226293
chargesum: 0.00000
title: Mulliken charges with hydrogens summed into heavy atoms:
elementType: O O C C C C C C C
charge: -0.137940 -0.134485 0.131710 -0.004202 -0.003646 0.055897 0.052860 0.082741 -0.042934
polarizability: 9.15770059e+01 -1.15874959e+00 7.90738084e+01 1.56678072e+00 -1.27391375e+00 5.60508632e+01
1716.lowfreq: -8.6730 -0.0008 0.0006 0.0008 3.5944 9.5766 52.8624 86.2093 140.0704
frequency: 52.8489 86.1709 140.0603 163.7028 222.0106 298.1218 311.7869 331.4081 416.4745 498.2070 557.2684 571.0811 660.0998 727.3078 763.3830 841.7517 871.6750 942.6523 949.4204 1002.4082 1018.1074 1043.2652 1072.8263 1120.6771 1155.1480 1165.8500 1192.8833 1237.4422 1249.4189 1271.7513 1291.6394 1311.0549 1335.4761 1394.3456 1427.3076 1469.7881 1477.4119 1482.7330 1485.3771 1645.9909 1670.7150 2926.1011 2977.6896 2982.7131 2987.1482 3006.7500 3040.8064 3074.6941 3076.6696 3079.3482 3086.3497
redmass: 5.7601 2.2175 2.0913 2.9436 1.1992 5.6020 3.8544 3.7228 2.6607 5.2390 2.8622 3.5587 4.6646 3.3327 1.2433 1.7554 2.9626 1.4625 1.8875 1.9821 1.6730 2.9591 2.5251 1.8946 1.8140 2.7390 1.4668 1.4885 1.4247 1.2859 1.2157 1.5145 1.5375 1.2139 1.0780 1.0649 1.0563 1.0700 1.0647 12.6012 12.5363 1.0797 1.0362 1.0670 1.0614 1.0641 1.0999 1.1007 1.0946 1.0990 1.1013
irintensity: 0.9532 0.8895 1.0472 3.7019 0.8306 3.8327 2.9591 1.9068 1.5594 0.5066 7.5609 2.4622 3.5608 3.1585 5.6010 6.9697 18.6681 8.9634 9.9336 11.8406 5.0374 32.4562 12.8290 10.8361 1.7947 27.3382 8.3401 13.8053 9.8490 4.9330 3.9275 0.7123 7.4739 12.8978 25.7623 5.8583 15.3717 0.3998 13.8055 182.1038 30.4299 9.9435 28.3652 9.5413 20.1603 30.5814 2.7212 55.5055 6.7495 47.3846 25.9956
temp: 298.150 k
press: 1.00000 atm
elementType: 8 8 6 6 6 6 6 6 6 1 1 1 1 1 1 1 1 1 1
symmnumber: 1
zpe: 407719.1 jmol-1
zpe.correction: 0.155292 hartree
zpe.thermalcorrener: 0.164476 hartree
zpe.thermalcorrenthalpy: 0.165420 hartree
zpe.thermalcorrgfe: 0.120706 hartree
zpe.sumelectzpe: -422.477649 hartree
zpe.sumelectthermal: -422.468465 hartree
zpe.sumelectthermalent: -422.467521 hartree
zpe.sumelectthermalfe: -422.512236 hartree
dipole: 3.5905 -3.9771 0.5976
dipole: 5.3913
quadrupole: -63.1124 -58.3075 -50.8427
quadrupole: 5.3528 -1.0593 -0.0589
quadrupole: -5.6915 -0.8867 6.5782 5.3528 -1.0593 -0.0589
hfenergy: -422.6329411 hartree
pointgroup: C01 [X(C7H10O2)]
dipole: 1.451016 -1.5332881 0.2064127 debye
dipolederiv: -0.4909964 0.0244561 -0.0061097 0.1237939 -0.8203714 0.0052016 -0.0233683 0.0322595 -0.2846894 -0.8863366 0.1432031 -0.050837 0.0829818 -0.4748043 0.0117118 -0.0734873 0.0209651 -0.295326 -0.4557468 0.187052 -0.0449479 0.1250843 -0.1159473 0.0407392 -0.0909453 0.1123889 0.1295933 0.0415457 -0.0432805 0.0282966 -0.0553568 0.0667189 -0.0302819 0.0250805 -0.0061236 0.1358155 -0.0970439 0.0552441 -0.011062 0.1603865 -0.4433323 0.0684235 -0.0714905 0.0741995 0.0987317 0.1887176 -0.0034232 -0.0043314 0.0879241 0.0235846 0.0151179 -0.027292 -0.0018234 0.1436393 0.7791279 -0.2227342 0.0788571 -0.3005092 0.7101399 -0.0421574 0.1281634 -0.0998372 0.1730015 0.7391711 -0.1969092 0.0726145 -0.1919742 0.8519617 -0.058432 0.0731746 -0.0530218 0.1667455 -0.0657449 0.0415839 -0.0040707 0.0080453 0.0597459 0.0215742 0.026896 0.0241739 0.0811564 0.0980474 0.0108243 -0.0165327 0.0043725 0.0565423 0.0101275 0.0166885 -0.0167989 -0.108389 -0.0184306 0.1104317 -0.0370081 0.1023328 -0.0536602 0.03951 -0.0508634 0.0589586 0.053342 0.046505 -0.004659 0.0392846 -0.0121894 0.0679767 0.0217052 0.0652543 -0.0417132 -0.1372877 0.0734364 0.0263716 0.0182321 0.0103839 0.1031351 0.0295456 0.0651244 0.0480982 -0.0624252 -0.0178085 -0.0545445 -0.0493026 -0.0617811 0.0254618 -0.060144 -0.0491638 -0.100598 0.0551139 0.0377757 -0.0010274 0.0016803 -0.0432044 -0.1122691 -0.0468792 0.0008606 -0.0611497 0.0692132 -0.0013908 0.0064237 -0.061268 0.0040167 0.0803822 -0.0089562 -0.0179088 0.0241808 -0.1593761 0.0749759 0.0148763 -0.0026084 0.0238611 0.078951 0.0046319 -0.0711538 0.0153905 -0.1728335 0.0950852 -0.0253718 -0.0236613 0.0294444 -0.1502011 -0.0709732 -0.0157226 -0.0791123 0.0554776 -0.1408894 -0.0685172 0.0727748 -0.097612 0.0459855 0.0495355 0.0901535 0.0495631 0.058497 unknown
polarizability: 91.6489643|-0.8871037|79.0499669|1.2880589|-0.9812111|56.0027462 unknown
InChI: InChI=1S/C7H10O2/c1-2-5-3-4-6(8)7(5)9/h5H,2-4H2,1H3
charge 0 multiplicity 1
19 atoms
O  -0.573962 2.029875 0.080653
O  -2.874544 0.131298 -0.129095
C  0.797279 -0.04429 0.318737
C  0.405497 -1.458623 -0.209873
C  -1.10807 -1.618865 0.106049
C  2.051458 0.601235 -0.310711
C  -0.476927 0.784068 0.132701
C  -1.67983 -0.207145 0.01291
C  3.353849 -0.150093 0.03489
H  0.958681 -0.11719 1.419645
H  1.013603 -2.258432 0.24255
H  0.567539 -1.495793 -1.303878
H  -1.258035 -1.982007 1.144024
H  -1.646046 -2.315785 -0.557879
H  2.113333 1.651047 0.033133
H  1.918821 0.640302 -1.410088
H  3.519761 -0.177387 1.128521
H  3.332256 -1.193385 -0.330172
H  4.227336 0.345869 -0.424818
