program: Gaussian 09
title: 000114518
version: EM64L-G09RevD.01
frameworkgroup: C1[X(C10H14O4)]
method: RPBEPBE
basis: SDD
operation: Freq
keyword: #pfreq=noraman
keyword: PBEPBE/SDD
title: #p freq=noraman PBEPBE/SDD
converged: YES YES NO NO
title: Mulliken charges:
elementType: O O O O C C C C C C C C C C H H H H H H H H H H H H H H
charge: -0.201391 -0.183091 -0.428614 -0.193465 0.218735 0.154021 0.245882 -0.522462 -0.498693 0.128274 -0.738896 -0.754370 -0.805007 0.075240 0.250823 0.247794 0.264268 0.256840 0.217680 0.225282 0.265342 0.235150 0.235312 0.222372 0.233071 0.244510 0.216346 0.389046
chargesum: 0.00000
title: Mulliken charges with hydrogens summed into heavy atoms:
elementType: O O O O C C C C C C C C C C
charge: -0.201391 -0.183091 -0.039568 -0.193465 0.218735 0.154021 0.245882 -0.023844 0.022415 0.128274 -0.030591 -0.061536 -0.111080 0.075240
polarizability: 1.30423363e+02 -4.03688630e+00 1.07107338e+02 1.34494343e-01 -4.67270057e+00 1.00487618e+02
1716.lowfreq: -15.5823 -3.2439 -0.0013 -0.0013 -0.0012 13.4219 42.9790 118.6679 132.4541
frequency: 42.9195 118.6416 132.4102 137.2261 148.8274 167.5455 200.0264 219.2070 242.7689 261.0082 275.2965 302.1765 334.3491 360.0972 392.8375 400.8134 421.3970 493.4429 524.6799 561.7401 591.9511 609.6241 621.5085 642.3850 700.0855 711.2064 753.7179 764.6693 837.1648 877.7298 891.1795 943.9854 954.5764 973.2765 978.6306 984.1561 1001.7897 1034.3466 1071.6308 1100.9196 1120.6142 1140.8421 1163.7541 1175.2062 1221.1685 1224.0454 1227.4518 1253.5261 1280.3439 1304.3652 1321.5133 1392.2641 1396.4481 1410.3092 1457.0348 1458.9232 1469.5319 1471.7567 1477.3333 1484.1872 1488.6152 1495.9059 1674.9972 1717.3720 2989.7798 2990.0860 2994.4428 3021.6964 3046.7629 3075.0844 3079.4840 3080.6936 3085.2894 3087.8086 3099.0793 3102.0232 3113.7402 3511.0031
redmass: 10.1147 2.6109 3.3933 4.8598 1.3581 1.1656 1.4370 1.6132 2.2797 3.8368 2.8088 2.3394 4.5494 2.9564 3.9295 4.8475 3.2770 4.3293 3.0501 4.2141 3.2352 1.9470 3.1647 4.4096 3.6252 5.0016 3.8362 2.2821 2.4193 2.3444 2.4530 1.7921 1.4992 3.0476 3.2921 2.7932 1.5920 1.8582 3.8431 1.9826 2.1592 2.0643 2.3032 2.0046 2.2761 1.7796 1.5642 2.5393 1.6003 2.2008 3.4530 1.2017 1.2356 1.1920 1.0632 1.0532 1.0606 1.0515 1.0532 1.0697 1.0597 1.0602 9.5835 12.2129 1.0365 1.0366 1.0370 1.0598 1.0620 1.0993 1.1041 1.0989 1.0993 1.0989 1.0993 1.0986 1.1042 1.0641
irintensity: 0.4547 0.2613 1.2513 0.1060 0.0234 0.2174 0.0299 0.6480 1.1426 0.2427 3.0706 1.6701 5.7066 2.3030 2.4109 1.8517 2.3465 3.3498 19.0477 0.0221 32.9665 58.0180 46.1774 10.6491 27.6123 8.6204 5.8519 11.3712 20.7665 29.4243 25.8666 9.8970 11.9178 53.1433 1.7310 184.9803 80.3709 24.7616 40.7339 27.1961 14.6371 8.8614 14.3862 8.1425 5.5022 7.2790 1.9257 18.1784 18.4100 8.6838 10.1423 19.6763 16.7362 26.8112 12.2726 3.8278 4.1887 7.9621 8.5114 7.8562 12.7022 7.5563 231.5295 310.7465 13.4920 14.7891 30.5644 26.2862 13.2607 2.9699 5.7324 36.9484 17.0161 17.2622 12.2226 29.8117 13.3761 34.4568
temp: 298.150 k
press: 1.00000 atm
elementType: 8 8 8 8 6 6 6 6 6 6 6 6 6 6 1 1 1 1 1 1 1 1 1 1 1 1 1 1
symmnumber: 1
zpe: 591472.2 jmol-1
zpe.correction: 0.225280 hartree
zpe.thermalcorrener: 0.239219 hartree
zpe.thermalcorrenthalpy: 0.240163 hartree
zpe.thermalcorrgfe: 0.185913 hartree
zpe.sumelectzpe: -689.291812 hartree
zpe.sumelectthermal: -689.277873 hartree
zpe.sumelectthermalent: -689.276929 hartree
zpe.sumelectthermalfe: -689.331179 hartree
dipole: -1.2647 6.0545 -1.1444
dipole: 6.2902
quadrupole: -80.4365 -94.4217 -79.6332
quadrupole: 2.5720 1.4577 3.2744
quadrupole: 4.3940 -9.5913 5.1973 2.5720 1.4577 3.2744
hfenergy: -689.517092 hartree
pointgroup: C01 [X(C10H14O4)]
dipole: -0.5169876 2.3127408 -0.7129572 debye
polarizability: 130.4815697|-3.8624815|105.9245927|0.462155|-5.2697119|101.6121571 unknown
InChI: InChI=1S/C10H14O4/c1-8(2)9(3)4-5-10(8,6(11)12)14-7(9)13/h11H,4-5H2,1-3H3
charge 0 multiplicity 1
28 atoms
O  0.002645 -1.487289 0.030728
O  2.276434 -1.951688 0.312774
O  -2.983163 0.541686 -0.581819
O  -2.640044 -1.176071 0.946255
C  0.102317 0.865108 0.535073
C  1.45561 0.39763 -0.146614
C  -0.727201 -0.207114 -0.290251
C  1.116999 0.517222 -1.684254
C  -0.39041 0.103716 -1.772649
C  1.382134 -1.119855 0.109851
C  0.054361 0.613408 2.058846
C  -0.289974 2.327738 0.248855
C  2.765631 1.042288 0.291361
C  -2.175853 -0.384365 0.105584
H  1.772269 -0.133907 -2.287181
H  1.282372 1.556359 -2.01783
H  -1.034885 0.906069 -2.163192
H  -0.549515 -0.797669 -2.386455
H  0.823572 1.221847 2.567718
H  -0.928004 0.908777 2.469483
H  0.217535 -0.445024 2.321111
H  -0.228644 2.603221 -0.816199
H  -1.325264 2.519267 0.582817
H  0.374836 3.005118 0.8150
H  2.932873 0.924692 1.376277
H  3.618383 0.564459 -0.222334
H  2.774937 2.120093 0.048336
H  -3.924851 0.434283 -0.27559
