program: Gaussian 09
title: 000114511
version: EM64L-G09RevD.01
frameworkgroup: C1[X(C8H14O6)]
method: RPBEPBE
basis: SDD
operation: Freq
keyword: #pfreq=noraman
keyword: PBEPBE/SDD
title: #p freq=noraman PBEPBE/SDD
converged: NO YES NO NO
title: Mulliken charges:
elementType: O O O O O O C C C C C C C C H H H H H H H H H H H H H H
charge: -0.292605 -0.223292 -0.450320 -0.420098 -0.429592 -0.200809 -0.081487 -0.097632 -0.164726 -0.368849 0.067020 -0.154065 -0.703136 -0.109438 0.233981 0.246489 0.279965 0.206062 0.249780 0.186936 0.244277 0.218514 0.231615 0.242834 0.366868 0.346739 0.215912 0.359055
chargesum: 0.00000
title: Mulliken charges with hydrogens summed into heavy atoms:
elementType: O O O O O O C C C C C C C C
charge: -0.292605 -0.223292 -0.083453 -0.073358 -0.070537 -0.200809 0.152494 0.148858 0.115239 0.086993 0.253956 0.090212 -0.010172 0.106474
polarizability: 1.18448964e+02 -2.11363391e+00 1.06330526e+02 5.23805679e+00 2.47372221e+00 9.13712161e+01
1716.lowfreq: -13.4129 -11.2403 -8.0338 -0.0008 -0.0003 0.0006 17.9587 44.6013 72.0845
frequency: 16.0343 44.5950 72.0551 85.0471 104.7887 136.3801 184.0078 191.6438 226.9872 249.8082 274.1502 286.8961 295.4993 314.6898 359.3760 373.2178 385.1422 405.5487 424.0775 444.0331 452.6730 485.4965 543.3520 616.9712 697.4390 741.7749 801.5585 803.2357 841.4412 860.9085 918.2896 935.4159 962.7311 985.4362 1004.3547 1016.6549 1047.6191 1065.8208 1073.4277 1084.5258 1102.1016 1130.6274 1152.8987 1188.3061 1190.9393 1215.1902 1235.1550 1263.1335 1279.9116 1287.5853 1315.7939 1322.9053 1330.6631 1341.1683 1356.6483 1365.7918 1370.5628 1382.3489 1386.3043 1402.9365 1459.7183 1466.9113 1469.1020 1611.7335 2895.4641 2928.6118 2963.4004 2968.2546 2978.3412 3013.3363 3036.1619 3070.1367 3113.2831 3118.5375 3120.8526 3424.3050 3541.8793 3584.1599
redmass: 6.0863 6.2106 5.0326 6.0748 3.9127 3.7950 1.1757 4.0998 3.7034 3.2978 3.4816 5.3573 2.8906 1.3684 2.4270 1.2725 3.5759 4.2323 2.3821 1.9487 2.9980 2.9486 3.6994 6.4733 3.7101 4.0885 2.9847 2.8306 2.4778 3.6026 3.0286 3.9644 2.4526 4.2653 3.6157 3.2333 2.5367 2.5066 2.7497 2.0040 2.1591 2.4051 1.9918 1.2493 1.3537 1.2084 1.3122 1.4584 1.3022 1.2409 1.2871 1.2095 1.1882 1.1765 1.4617 1.3329 1.4252 1.4666 1.1696 1.3948 1.0432 1.0606 1.0786 8.1190 1.0840 1.0820 1.0830 1.0682 1.0873 1.0359 1.0849 1.0863 1.0975 1.1004 1.1003 1.0646 1.0657 1.0668
irintensity: 2.6439 0.9117 3.0610 3.6307 1.0649 1.1189 0.1755 2.6801 7.3281 11.9303 4.2504 13.6935 38.6694 95.0404 20.0440 177.6675 49.8695 1.8800 74.9635 25.8743 42.3916 12.6738 4.1855 2.0340 12.9515 9.1529 55.1712 33.5236 19.7471 101.1142 14.5878 14.2091 66.2321 150.8216 75.6356 9.3700 15.4223 111.6395 52.0368 70.9332 23.3828 4.3570 25.9645 33.7908 44.6237 27.3505 10.5592 4.6237 2.6833 11.4571 14.6774 3.2808 43.2578 5.9402 22.9265 19.5975 12.8631 2.6091 26.9676 49.9843 9.5726 11.3736 7.9526 141.9839 59.7649 40.3199 11.1058 48.0156 63.3569 9.4896 23.2777 11.0773 21.8490 16.4940 16.5852 28.1019 12.2345 19.1267
temp: 298.150 k
press: 1.00000 atm
elementType: 8 8 8 8 8 8 6 6 6 6 6 6 6 6 1 1 1 1 1 1 1 1 1 1 1 1 1 1
symmnumber: 1
zpe: 581374.7 jmol-1
zpe.correction: 0.221434 hartree
zpe.thermalcorrener: 0.236702 hartree
zpe.thermalcorrenthalpy: 0.237646 hartree
zpe.thermalcorrgfe: 0.178118 hartree
zpe.sumelectzpe: -763.404360 hartree
zpe.sumelectthermal: -763.389093 hartree
zpe.sumelectthermalent: -763.388148 hartree
zpe.sumelectthermalfe: -763.447676 hartree
dipole: 2.6674 -1.3857 -0.3808
dipole: 3.0299
quadrupole: -98.8238 -79.4356 -87.3828
quadrupole: -1.2235 0.5960 -1.4647
quadrupole: -10.2764 9.1118 1.1646 -1.2235 0.5960 -1.4647
hfenergy: -763.6257941 hartree
pointgroup: C01 [X(C8H14O6)]
dipole: 1.0262119 -0.5413898 -0.2734095 debye
polarizability: 118.7253882|-2.9113595|105.4695346|3.7560146|4.5006126|91.9557836 unknown
InChI: InChI=1S/C8H14O6/c1-4-13-3-6(11)8(14-4)7(12)5(10)2-9/h2,4-8,10-12H,3H2,1H3
charge 0 multiplicity 1
28 atoms
O  0.711152 -0.888646 0.276215
O  3.050333 -0.423475 -0.136311
O  1.147365 2.748738 -0.591964
O  -0.713805 1.242346 1.892761
O  -3.3411 0.215633 0.948165
O  -3.302942 -0.836441 -1.543361
C  0.310194 0.451934 -0.219431
C  1.465551 1.454938 0.020965
C  -0.989455 0.835189 0.513683
C  2.7410 0.927209 -0.65698
C  1.952356 -1.344445 -0.389793
C  -2.071529 -0.296373 0.477553
C  2.321299 -2.700941 0.178251
C  -2.219492 -0.918401 -0.910019
H  0.123299 0.405324 -1.317681
H  1.635142 1.547444 1.110058
H  -1.426037 1.733208 0.04558
H  2.601676 0.895757 -1.758916
H  3.613463 1.551879 -0.41566
H  1.74745 -1.364332 -1.488522
H  -1.724786 -1.105465 1.155472
H  1.504469 -3.421903 0.009447
H  3.23726 -3.072858 -0.309177
H  2.506559 -2.613047 1.261253
H  0.673574 3.309274 0.071854
H  -0.350219 0.460129 2.38367
H  -1.341141 -1.468679 -1.312069
H  -3.986137 0.145508 0.187955
