program: Gaussian 09
title: 000114479
version: EM64L-G09RevD.01
frameworkgroup: C1[X(C12H25O4P)]
method: RPBEPBE
basis: SDD
operation: Freq
keyword: #p
keyword: freq=noraman
keyword: PBEPBE/SDD
title: #p freq=noraman PBEPBE/SDD
converged: YES YES NO NO
title: Mulliken charges:
elementType: P O O O O C C C C C C C C C C C C H H H H H H H H H H H H H H H H H H H H H H H H H
charge: 1.087700 -0.244004 -0.244166 -0.683948 -0.625034 -0.356603 -0.356948 -0.071856 -0.072000 0.098978 -0.129153 -0.721967 -0.701292 -0.701155 -0.721376 -0.704610 -0.704738 0.268071 0.268288 0.248337 0.248370 0.179262 0.236901 0.218341 0.256019 0.210925 0.199397 0.218664 0.244487 0.199361 0.218590 0.244445 0.255841 0.210995 0.218188 0.384090 0.197880 0.218428 0.245417 0.197883 0.218513 0.245480
chargesum: 0.00000
title: Mulliken charges with hydrogens summed into heavy atoms:
elementType: P O O O O C C C C C C C C C C C C
charge: 1.087700 -0.244004 -0.244166 -0.299858 -0.625034 -0.088532 -0.088660 0.176480 0.176370 0.278240 0.107748 -0.036683 -0.038745 -0.038758 -0.036352 -0.042885 -0.042862
polarizability: 1.89137139e+02 -4.21530402e-03 1.84820118e+02 4.38466370e-03 8.65210787e-01 1.30934190e+02
1716.lowfreq: -9.8025 0.0010 0.0012 0.0018 10.3915 12.3296 33.2225 49.2517 54.5176
frequency: 33.2220 49.2256 54.4505 71.1888 90.0025 96.4134 105.5764 109.3811 131.1135 171.6739 179.4059 190.1243 201.0154 209.1062 217.2339 218.5939 229.1241 233.5150 234.9490 240.3720 255.5739 284.5410 291.7779 336.2849 344.8634 367.6117 377.4183 387.4653 413.7189 414.1018 442.3496 473.7635 526.8558 546.9066 602.9680 654.3310 688.7336 702.7911 838.1575 855.7359 872.6740 896.3176 902.2135 917.9561 924.6311 926.5734 933.6209 940.0648 953.4659 958.8882 966.0634 966.1363 969.2276 979.2210 1032.9762 1039.0495 1108.8456 1130.2487 1132.9493 1135.9311 1142.3269 1164.1485 1184.2352 1185.6035 1203.9722 1205.4853 1220.1631 1256.0225 1263.6070 1295.7059 1305.2277 1307.3536 1309.6147 1329.1595 1345.8466 1352.0446 1368.1455 1374.4468 1377.4419 1378.6436 1394.8176 1396.6534 1400.2355 1463.4498 1464.0730 1467.0038 1469.6508 1472.5153 1473.9122 1478.8583 1482.0553 1483.0741 1492.0912 1497.8220 1498.9418 2892.7349 2949.0955 2952.7698 2976.0291 2976.2253 2976.9983 2978.4145 2978.6644 2979.9579 3008.9069 3009.2394 3009.9909 3065.8195 3068.8459 3068.9468 3074.5516 3078.1545 3078.5636 3079.8679 3080.2709 3097.9723 3098.0960 3098.6502 3101.6754 3597.7483
redmass: 3.7726 2.5254 2.7077 3.0559 4.0019 3.0713 3.3318 3.5445 3.2395 3.8664 3.7118 1.3669 1.3907 1.8359 1.2087 1.4529 1.2074 2.6239 2.0048 1.1618 1.6961 2.7178 2.4857 4.7560 3.1181 2.5977 2.5930 2.5173 2.4038 3.4516 3.0564 5.0422 4.4560 4.7020 5.7577 11.9934 3.9793 3.7486 2.3094 2.6792 2.2982 3.2154 2.8332 3.9122 1.2094 1.3953 1.3118 1.5668 1.8490 1.7531 1.5274 1.4540 1.5907 2.1250 6.0316 2.6467 1.9025 2.3178 2.1794 2.1113 2.2077 1.9332 1.8247 1.9169 1.4320 1.9822 1.3806 1.1288 1.1864 1.3246 1.4429 1.4140 1.4314 1.2205 1.3972 1.3136 1.5839 1.2014 1.1979 1.1988 1.2118 1.2014 1.2332 1.0510 1.0514 1.0473 1.0497 1.0464 1.0484 1.0468 1.0531 1.0507 1.0615 1.0478 1.0507 1.0835 1.0828 1.0836 1.0360 1.0361 1.0376 1.0373 1.0373 1.0389 1.0837 1.0839 1.0827 1.0981 1.0990 1.0990 1.0972 1.0988 1.0988 1.1001 1.1000 1.0991 1.0991 1.0993 1.0990 1.0662
irintensity: 0.3900 0.6121 3.0995 0.5184 1.0586 30.7425 37.6829 1.2157 24.1707 6.6695 1.2290 25.3878 14.0494 6.1635 2.3289 1.5046 0.2843 3.0535 5.1726 10.2260 0.7467 2.2764 2.6589 7.6393 16.4994 0.0109 4.4322 4.3532 0.4062 21.9220 2.2887 49.6860 1.1963 6.6826 2.0458 159.0756 9.8828 6.5585 0.7661 17.3776 2.9495 122.6840 19.4918 24.0811 17.3022 2.5485 14.7995 7.5389 20.0076 14.6535 5.1600 12.5379 7.0930 16.2055 216.4833 90.4652 0.3450 1.2209 13.6547 4.3921 4.4682 7.4642 4.7573 31.3360 5.5604 3.7255 3.1885 0.3033 20.5114 4.3612 0.2745 1.0186 0.3612 5.7145 1.5973 13.8309 5.1942 3.3309 22.8258 13.2152 39.4730 29.6438 10.5784 0.8381 9.5343 3.2098 4.0282 5.1890 0.1503 22.2204 1.4255 6.1969 26.3767 11.3211 41.0735 42.3128 1.7525 23.8128 11.1930 26.3267 15.5716 60.9752 18.4047 42.7528 3.8024 7.9595 15.1227 1.5652 8.3204 9.9908 76.4841 37.5179 99.8774 28.5221 11.1200 18.9334 33.0030 18.2677 34.8966 49.3319
temp: 298.150 k
press: 1.00000 atm
elementType: 15 8 8 8 8 6 6 6 6 6 6 6 6 6 6 6 6 1 1 1 1 1 1 1 1 1 1 1 1 1 1 1 1 1 1 1 1 1 1 1 1 1
symmnumber: 1
zpe: 935128.2 jmol-1
zpe.correction: 0.356172 hartree
zpe.thermalcorrener: 0.378328 hartree
zpe.thermalcorrenthalpy: 0.379272 hartree
zpe.thermalcorrgfe: 0.306131 hartree
zpe.sumelectzpe: -1112.974041 hartree
zpe.sumelectthermal: -1112.951884 hartree
zpe.sumelectthermalent: -1112.950940 hartree
zpe.sumelectthermalfe: -1113.024081 hartree
dipole: -0.0056 1.4978 2.9059
dipole: 3.2692
quadrupole: -106.6395 -111.3578 -119.2395
quadrupole: 0.0286 -0.0139 -4.9403
quadrupole: 5.7728 1.0545 -6.8272 0.0286 -0.0139 -4.9403
hfenergy: -1113.3302122 hartree
pointgroup: C01 [X(C12H25O4P1)]
dipole: 0.0038998 0.5920799 -1.1418154 debye
polarizability: 189.1362879|-0.0365858|184.8243717|-0.1841612|-0.730554|130.9307879 unknown
InChI: InChI=1S/C12H25O4P/c1-7(2)10-15-11(8(3)4)17(13,14)12(16-10)9(5)6/h7-13H,1-6H3
charge 0 multiplicity 1
42 atoms
P  -0.029064 -1.616079 -0.070772
O  1.193395 0.862849 0.266099
O  -1.20543 0.88289 0.274695
O  -0.042624 -2.431147 -1.641345
O  -0.0338 -2.623666 1.18016
C  1.485044 -0.450343 -0.32593
C  -1.524216 -0.425061 -0.316111
C  2.781567 -0.985586 0.306378
C  -2.825567 -0.938133 0.324454
C  -0.002685 1.517272 -0.270439
C  0.010239 2.984045 0.179529
C  3.112257 -2.410968 -0.199577
C  3.944262 -0.005235 0.019368
C  -3.972467 0.063588 0.047767
C  -3.185333 -2.356118 -0.182498
C  1.292246 3.692595 -0.315001
C  -1.261575 3.712954 -0.311834
H  1.574945 -0.368876 -1.432068
H  -1.620307 -0.340965 -1.421476
H  2.614128 -1.032249 1.400327
H  -2.651361 -0.990528 1.417089
H  -0.007418 1.410409 -1.383903
H  0.011385 2.966648 1.286865
H  4.098655 -2.720415 0.189929
H  2.368799 -3.147375 0.154115
H  3.157278 -2.44722 -1.304408
H  4.158467 0.044915 -1.065913
H  4.862647 -0.346918 0.530121
H  3.705349 1.010951 0.374664
H  -4.191037 0.122576 -1.036196
H  -4.894106 -0.264636 0.561467
H  -3.714375 1.073865 0.406511
H  -2.452547 -3.106571 0.16374
H  -3.239029 -2.38879 -1.287021
H  -4.174146 -2.648645 0.213817
H  -0.046897 -3.417791 -1.551864
H  1.327485 3.722742 -1.421548
H  1.312214 4.735877 0.048035
H  2.197858 3.178402 0.046794
H  -1.298218 3.745008 -1.41829
H  -1.264823 4.755997 0.052449
H  -2.174394 3.212332 0.050923
