program: Gaussian 09
title: 000114434
version: EM64L-G09RevD.01
frameworkgroup: C1[X(C16H15P)]
method: RPBEPBE
basis: SDD
operation: Freq
keyword: #pfreq=noraman
keyword: PBEPBE/SDD
title: #p freq=noraman PBEPBE/SDD
converged: YES YES NO NO
title: Mulliken charges:
elementType: P C C C C C C C C C C C C C C C C H H H H H H H H H H H H H H H
charge: 0.637327 -0.167820 -0.173427 -0.501260 -0.507093 -0.128407 -0.299116 -0.291238 -0.253467 -0.248147 -0.232207 -0.234323 -0.280607 -0.302476 -0.230874 -0.225605 -0.241160 0.249498 0.249481 0.267293 0.248545 0.261682 0.260191 0.237535 0.237538 0.241026 0.240347 0.254403 0.249591 0.226591 0.227888 0.228290
chargesum: 0.00000
title: Mulliken charges with hydrogens summed into heavy atoms:
elementType: P C C C C C C C C C C C C C C C C
charge: 0.637327 -0.167820 -0.173427 -0.002281 0.008746 -0.128407 -0.037433 -0.031047 -0.015932 -0.010609 0.008819 0.006024 -0.026204 -0.052885 -0.004283 0.002283 -0.012871
polarizability: 2.06847221e+02 1.44745380e+00 2.22752104e+02 1.45689284e+01 -2.33436483e+00 1.44770843e+02
1716.lowfreq: -10.6255 -0.0020 -0.0008 0.0008 7.4502 11.5282 26.9364 39.1787 52.0768
frequency: 26.8294 39.1532 52.0682 62.0275 73.3328 88.2223 183.2914 189.2944 209.5467 248.4555 268.2762 281.8866 365.5105 376.2156 398.1910 402.5225 447.6635 468.1358 503.6465 523.6049 528.4059 613.6740 666.9572 690.7863 694.5005 704.9992 751.9257 805.6333 806.3658 835.1200 836.1580 858.3569 873.6186 877.9343 902.4074 907.0360 923.4502 942.8138 943.1951 955.7044 961.6867 979.7198 985.5045 994.9883 1004.3282 1009.1035 1018.2588 1066.9372 1068.1956 1075.2951 1077.0657 1081.1787 1087.3634 1095.1106 1096.0387 1171.0312 1189.7329 1212.6490 1218.5333 1256.7557 1258.0495 1306.3003 1340.4629 1341.6778 1370.0413 1388.3336 1393.1130 1422.5847 1463.3144 1494.1238 1499.8407 1572.4525 1576.0724 1580.6881 1593.2113 2977.3698 2988.6379 3023.1711 3029.3583 3112.7631 3119.3366 3131.8610 3141.9620 3159.3162 3159.3632 3160.5477 3172.0152 3172.1261 3196.7561 3196.9377
redmass: 3.6079 3.7274 3.7657 4.8529 4.4490 4.0436 4.3933 4.0785 4.1665 3.6461 4.2793 3.9439 1.9265 2.1832 2.8113 4.8754 5.6479 9.2105 3.9334 2.4960 2.5572 6.4545 6.6313 1.2197 1.2115 2.0488 1.6139 5.8473 5.8186 4.7760 4.7566 1.2456 2.1475 2.1796 1.3225 1.3435 1.3601 1.3655 1.3588 1.8393 1.8790 1.3813 6.2320 1.3030 1.6916 1.7154 3.3839 3.2063 3.5629 2.3664 1.7578 1.1763 1.1256 1.1758 1.1725 1.0527 1.1221 1.4654 1.4254 2.2785 2.2910 1.3632 1.9813 2.0008 6.4676 1.1273 1.1404 2.1762 2.0340 6.0391 6.3858 5.4440 5.4769 5.8985 5.8898 1.0609 1.0614 1.0968 1.0955 1.0867 1.0861 1.0910 1.0958 1.0885 1.0884 1.1013 1.0950 1.0950 1.1084 1.1084
irintensity: 0.0567 0.0403 0.0796 0.4442 0.1510 0.0754 2.1104 0.6804 0.4195 1.1371 0.5122 0.5205 12.6432 10.1966 1.1225 2.8538 44.3328 26.6735 18.1361 1.3118 4.3487 0.3914 0.0594 45.3509 58.6443 40.1731 53.1252 4.1989 8.4933 0.9881 0.8677 0.1706 3.5755 3.2447 27.8291 20.4642 4.2573 0.1129 0.1238 1.7680 23.9824 0.3515 1.4452 0.4748 44.4240 23.5680 9.7233 23.6639 20.0346 0.6226 0.2875 1.5772 0.7502 0.0248 0.2143 0.0722 2.1291 2.9396 9.3393 8.2495 3.5496 2.9636 4.2990 14.7770 1.1558 31.1640 16.1984 11.7784 26.8878 1.2072 1.5201 0.1499 1.3939 0.3567 18.8998 5.1001 3.5689 6.1259 5.9497 4.7531 0.4198 4.0959 36.7513 7.7137 5.9334 37.1133 3.6462 18.1305 36.0600 12.9036
temp: 298.150 k
press: 1.00000 atm
elementType: 15 6 6 6 6 6 6 6 6 6 6 6 6 6 6 6 6 1 1 1 1 1 1 1 1 1 1 1 1 1 1 1
symmnumber: 1
zpe: 665830.6 jmol-1
zpe.correction: 0.253601 hartree
zpe.thermalcorrener: 0.269051 hartree
zpe.thermalcorrenthalpy: 0.269995 hartree
zpe.thermalcorrgfe: 0.209039 hartree
zpe.sumelectzpe: -958.670910 hartree
zpe.sumelectthermal: -958.655461 hartree
zpe.sumelectthermalent: -958.654517 hartree
zpe.sumelectthermalfe: -958.715473 hartree
dipole: -0.1097 0.1119 2.0850
dipole: 2.0909
quadrupole: -102.9154 -98.1630 -106.0674
quadrupole: 1.1452 1.7564 -0.4286
quadrupole: -0.5335 4.2190 -3.6855 1.1452 1.7564 -0.4286
hfenergy: -958.9245118 hartree
pointgroup: C01 [X(C16H15P1)]
dipole: -0.0540478 -0.1161351 -0.8125938 debye
polarizability: 206.4675498|-3.0121645|221.6876015|-15.1925094|-9.2092874|146.2150169 unknown
InChI: InChI=1S/C16H15P/c1-2-8-14(9-3-1)17(15-10-4-5-11-15)16-12-6-7-13-16/h1-10,12H,11,13H2
charge 0 multiplicity 1
32 atoms
P  -0.300001 0.075659 1.288929
C  -1.252839 1.360291 0.320816
C  -0.914098 -1.529188 0.54568
C  -1.702063 1.308855 -1.13287
C  -0.616577 -2.118017 -0.827643
C  1.413801 0.19636 0.477671
C  -1.685236 2.553535 0.862173
C  -1.745747 -2.403211 1.215845
C  -2.42411 2.626555 -1.338212
C  -1.389871 -3.422262 -0.839786
C  -2.402014 3.338283 -0.161458
C  -2.045473 -3.567092 0.36082
C  1.852189 1.372857 -0.180091
C  2.325629 -0.881304 0.635639
C  3.16943 1.463373 -0.687924
C  3.639859 -0.791999 0.124824
C  4.066959 0.381138 -0.541745
H  -2.377593 0.447461 -1.314561
H  -0.844794 1.1875 -1.826685
H  0.469758 -2.276131 -0.981241
H  -0.936064 -1.441386 -1.645772
H  -1.527456 2.874248 1.895809
H  -2.125119 -2.262389 2.231919
H  -2.891222 2.926397 -2.279669
H  -1.396406 -4.12071 -1.68045
H  -2.845922 4.322543 0.009518
H  -2.680612 -4.406487 0.655917
H  1.165432 2.220489 -0.291697
H  2.009922 -1.790087 1.163671
H  3.492187 2.379462 -1.196205
H  4.330068 -1.633998 0.25237
H  5.086881 0.451654 -0.936195
