program: Gaussian 09
title: 000114323
version: EM64L-G09RevD.01
frameworkgroup: C1[X(C18H21ClN2O2S)]
method: RPBEPBE
basis: SDD
operation: Freq
keyword: #p
keyword: freq=noraman
keyword: PBEPBE/SDD
title: #p freq=noraman PBEPBE/SDD
converged: YES YES NO NO
title: Mulliken charges:
elementType: Cl S O O N N C C C C C C C C C C C C C C C C C C H H H H H H H H H H H H H H H H H H H H H
charge: -0.068516 0.218394 -0.300666 -0.433807 -0.313088 -0.099541 -0.361749 -0.431543 0.427020 0.551259 -0.343918 -0.306520 -0.384809 0.301945 -0.302231 -0.499959 -0.257921 -0.565237 0.335640 -0.105166 -0.617856 -0.613600 -0.271547 -0.528167 0.189217 0.287431 0.227278 0.206525 0.188349 0.230430 0.266752 0.275534 0.252406 0.248360 0.223441 0.187864 0.223353 0.187486 0.242053 0.217023 0.259506 0.225614 0.240392 0.235319 0.357251
chargesum: 0.00000
title: Mulliken charges with hydrogens summed into heavy atoms:
elementType: Cl S O O N N C C C C C C C C C C C C C C C C C C
charge: -0.068516 0.218394 -0.300666 -0.076557 -0.313088 -0.099541 0.114899 0.002260 0.427020 0.551259 0.074860 -0.306520 -0.384809 0.301945 -0.035479 -0.224424 -0.005514 -0.316877 0.335640 -0.105166 0.016802 0.032961 -0.012040 0.173157
polarizability: 3.37211578e+02 -2.88696797e+01 1.90157796e+02 4.91090180e+00 2.79491941e+01 2.20400869e+02
1716.lowfreq: -7.1080 -5.9008 -4.1968 -0.0022 -0.0021 -0.0014 19.2147 24.1234 33.8600
frequency: 18.5338 24.0593 33.8358 35.3733 52.9551 68.8485 86.8153 101.8924 104.5489 146.6447 152.9658 161.2464 173.6172 189.1120 210.3677 215.3849 219.0373 235.0552 269.2381 274.8516 295.9922 300.9945 317.8531 328.4878 331.0388 357.9079 358.9143 377.4920 391.7704 402.4419 410.0473 431.2822 461.5431 476.7931 487.8836 528.1898 538.0459 553.6198 555.1322 589.4082 612.6455 625.8717 664.1073 704.6124 723.3016 734.6178 754.8985 798.5960 814.1324 829.8600 836.1275 853.2052 857.2499 872.9265 890.7784 910.8948 931.5921 969.8393 997.1424 1002.8372 1029.6689 1034.3940 1063.0704 1070.2664 1078.8808 1084.5031 1092.1679 1103.9443 1112.9216 1130.7988 1135.1792 1145.1974 1154.0382 1161.7250 1189.6892 1207.4451 1232.4540 1256.1523 1263.0712 1267.9555 1278.2696 1296.3246 1325.7286 1346.4544 1352.3781 1363.8950 1372.5775 1374.6945 1405.0485 1413.1643 1415.9012 1436.5502 1438.4818 1455.5536 1457.7034 1461.0382 1462.5522 1467.0935 1469.2618 1474.9117 1475.7462 1477.8280 1484.5496 1491.9795 1555.0247 1577.9417 1588.4229 1615.8546 2844.8666 2848.0497 2866.0428 2967.9444 2969.3294 2990.5210 3018.4445 3021.5711 3024.0323 3043.1959 3059.1166 3076.4058 3080.2619 3111.5721 3121.1414 3144.0343 3148.7833 3173.0269 3174.0156 3182.3655 3589.0113
redmass: 4.2749 3.9905 4.2562 5.0144 4.4502 3.7269 6.2516 3.7034 3.7097 2.4904 3.8796 1.3957 3.3386 4.9382 1.2155 3.0902 1.4381 4.5109 3.7267 6.4534 2.7389 5.6552 5.9246 1.1405 3.0642 6.0204 5.4895 2.1347 5.3958 2.6488 2.9368 3.0592 5.2786 3.7762 4.7600 7.3260 3.4278 5.2446 5.6668 5.3723 3.5303 4.5635 5.8688 4.3841 3.4863 3.7888 3.9607 1.3318 3.2924 3.0579 1.6261 1.5218 1.4729 2.8356 5.1743 6.0141 1.3431 2.0593 3.0455 3.7467 3.6053 1.5144 2.2309 3.3484 1.8790 1.7753 1.6744 1.6226 1.5122 1.4152 1.4382 1.3800 1.4363 1.6504 1.6047 1.6156 1.6974 1.5405 2.7226 1.8644 2.6387 1.5930 2.0919 1.4726 1.4792 4.7158 1.4348 5.4690 2.8468 2.2962 1.1468 1.5687 1.1728 1.0806 1.0908 2.4739 1.0560 1.9073 1.4377 1.0535 1.0957 1.0884 1.0559 1.1564 6.9595 7.4178 7.9144 7.3553 1.0584 1.0657 1.0608 1.0326 1.0664 1.0644 1.0727 1.0794 1.0813 1.0989 1.1039 1.1008 1.1006 1.0914 1.1018 1.0920 1.0898 1.0914 1.0927 1.0961 1.0661
irintensity: 0.2478 0.0679 0.8483 0.2483 0.4366 0.7977 1.3353 1.5873 2.4814 0.5031 2.3815 0.1041 0.4528 1.6714 0.6692 1.7253 0.5560 0.6449 1.0853 6.1116 2.4383 7.5438 15.5688 136.0542 7.6195 1.8728 9.8146 6.4503 1.9776 0.0098 3.0270 11.2346 12.8534 5.9850 5.3433 4.8878 8.7700 7.7294 1.9775 5.4558 9.3503 6.8233 2.4396 6.0544 20.4960 10.6921 4.4076 38.5180 52.7691 7.4023 21.1086 28.1180 26.2067 26.7280 92.3690 35.8341 0.5122 18.4688 15.3316 33.0702 57.6592 9.6742 23.7491 23.5537 23.9948 15.9641 20.7853 22.1538 15.0922 22.8650 3.2759 226.9436 18.3779 10.1895 59.4766 38.7303 10.1927 8.5479 48.6181 1.7000 38.0877 4.1856 25.3868 4.7159 14.6105 48.3206 5.0914 7.3116 15.0850 76.4767 2.0892 119.0844 0.2470 8.9296 10.3768 160.6429 10.0695 111.1387 33.4515 10.1733 21.3016 16.7300 9.4502 26.7289 46.2765 59.0860 36.0330 142.6046 74.8414 50.9852 274.0459 36.1369 53.3595 50.6535 28.7207 21.7491 26.0137 42.5563 37.3893 20.0260 52.5146 0.7017 23.3096 6.2796 3.1543 1.6393 0.7869 1.4407 55.8339
temp: 298.150 k
press: 1.00000 atm
elementType: 17 16 8 8 7 7 6 6 6 6 6 6 6 6 6 6 6 6 6 6 6 6 6 6 1 1 1 1 1 1 1 1 1 1 1 1 1 1 1 1 1 1 1 1 1
symmnumber: 1
zpe: 928640.9 jmol-1
zpe.correction: 0.353701 hartree
zpe.thermalcorrener: 0.378163 hartree
zpe.thermalcorrenthalpy: 0.379107 hartree
zpe.thermalcorrgfe: 0.298088 hartree
zpe.sumelectzpe: -1814.761419 hartree
zpe.sumelectthermal: -1814.736956 hartree
zpe.sumelectthermalent: -1814.736012 hartree
zpe.sumelectthermalfe: -1814.817032 hartree
dipole: 1.7147 0.5201 1.7167
dipole: 2.4815
quadrupole: -158.0108 -152.3805 -149.0120
quadrupole: 0.1227 8.6521 -3.9502
quadrupole: -4.8764 0.7540 4.1224 0.1227 8.6521 -3.9502
hfenergy: -1815.1151192 hartree
pointgroup: C01 [X(C18H21Cl1N2O2S1)]
dipole: 0.7608026 -0.3596072 -0.4949977 debye
polarizability: 338.2425283|8.2349386|194.9007016|19.9527817|34.1668171|214.627014 unknown
InChI: InChI=1S/C18H21ClN2O2S/c1-20(2)7-4-8-21-14-9-12(19)5-6-16(14)24-17-11-13(22)10-15(23-3)18(17)21/h5-6,9-11,22H,4,7-8H2,1-3H3
charge 0 multiplicity 1
45 atoms
Cl -5.335617 0.193802 -1.977831
S  -0.411324 1.454395 1.976777
O  1.958356 -0.308476 -2.414529
O  4.489367 2.536804 0.643386
N  -0.303486 -0.294732 -0.540944
N  1.326155 -3.127734 1.218325
C  -0.218891 -1.713219 -0.990376
C  -0.852573 -2.688271 0.027083
C  0.889611 0.459808 -0.303996
C  -1.571056 0.30227 -0.318419
C  -0.089381 -2.71225 1.370675
C  1.015186 1.311444 0.826905
C  -1.756431 1.232364 0.745039
C  2.001201 0.420343 -1.200563
C  -2.685492 -0.002775 -1.147999
C  2.196362 2.014114 1.122348
C  -2.991361 1.880625 0.938276
C  3.214957 1.071532 -0.894813
C  3.315745 1.854228 0.275768
C  -3.919056 0.624132 -0.904499
C  1.485322 -4.57869 1.001292
C  2.189172 -2.632747 2.310343
C  -4.10179 1.57566 0.115361
C  1.033383 0.254181 -3.422386
H  -0.686734 -1.841226 -1.987891
H  0.847338 -1.961143 -1.094478
H  -1.90951 -2.421133 0.220851
H  -0.863064 -3.696644 -0.431841
H  -0.638438 -3.370637 2.091986
H  -0.100572 -1.691926 1.797701
H  -2.585876 -0.71784 -1.96819
H  2.267724 2.669692 1.993875
H  -3.102012 2.604276 1.752313
H  4.045611 0.970335 -1.602652
H  0.912792 -4.901806 0.114408
H  1.141912 -5.192222 1.87411
H  2.549251 -4.812146 0.816222
H  1.92739 -3.055359 3.313883
H  2.116053 -1.53255 2.370721
H  3.241813 -2.893773 2.097271
H  -5.071158 2.053648 0.275578
H  1.379715 1.257043 -3.737518
H  0.002778 0.328301 -3.028342
H  1.066741 -0.441112 -4.274728
H  5.213088 2.368213 -0.009198
