program: Gaussian 09
title: 000114320
version: EM64L-G09RevD.01
frameworkgroup: C1[X(C21H28N2S)]
method: RPBEPBE
basis: SDD
operation: Freq
keyword: #p
keyword: freq=noraman
keyword: PBEPBE/SDD
title: #p freq=noraman PBEPBE/SDD
converged: NO YES NO NO
title: Mulliken charges:
elementType: S N N C C C C C C C C C C C C C C C C C C C C C H H H H H H H H H H H H H H H H H H H H H H H H H H H H
charge: 0.198768 -0.229787 -0.077355 0.125108 0.559148 0.515487 -0.506844 -0.406594 -0.476555 -0.409112 0.498679 -0.699576 -0.701019 -0.749144 -0.474271 -0.376024 -0.341929 -0.349113 -0.324325 -0.276805 -0.261332 -0.253318 -0.614844 -0.629212 0.239102 0.247196 0.233996 0.246806 0.261291 0.206982 0.214344 0.224428 0.214547 0.207219 0.224054 0.217880 0.218338 0.219083 0.227877 0.241754 0.216070 0.173669 0.241115 0.242781 0.226130 0.230954 0.225252 0.187328 0.223734 0.221895 0.184738 0.241404
chargesum: 0.00000
title: Mulliken charges with hydrogens summed into heavy atoms:
elementType: S N N C C C C C C C C C C C C C C C C C C C C C
charge: 0.198768 -0.229787 -0.077355 0.125108 0.559148 0.515487 -0.020546 -0.406594 -0.215264 0.071691 0.498679 -0.053822 -0.055199 -0.093843 -0.246393 -0.134270 -0.341929 0.040626 -0.083210 -0.034024 -0.035202 -0.022363 0.021471 0.018824
polarizability: 3.36922214e+02 4.25300523e+01 3.19034567e+02 3.61884059e+00 1.43465628e+01 1.60425555e+02
1716.lowfreq: -14.4480 -12.4516 -2.2462 -0.0016 -0.0013 -0.0012 9.4268 12.2367 32.5770
frequency: -10.7707 9.6992 32.3373 35.4720 38.4889 77.7344 100.2696 114.4115 130.4572 145.4281 172.9238 179.0789 195.7762 197.3716 225.8070 236.0596 237.2977 244.5291 247.6007 271.7935 289.0304 305.4776 317.1487 326.0341 336.9845 362.8384 369.5377 378.5638 414.7098 423.4467 427.7670 439.4776 443.3170 448.8779 473.9272 492.6721 497.1188 542.4312 545.5625 607.6370 622.6235 649.0952 671.5480 699.6965 717.6433 732.7932 747.8480 767.5831 770.0186 812.9799 814.7233 834.5927 840.5710 861.5684 888.0369 905.2128 917.3861 922.9661 932.5328 936.0050 945.1592 966.1832 999.6275 1018.7049 1026.3961 1029.0068 1031.3345 1034.3637 1037.7273 1048.0800 1070.7393 1092.3461 1098.9609 1103.4695 1126.1495 1135.5388 1144.3458 1172.9657 1177.2445 1177.8326 1204.4299 1214.1059 1219.2860 1249.4521 1252.5628 1262.1836 1269.9267 1284.3136 1287.7450 1298.7762 1299.5806 1344.9659 1364.3479 1374.2035 1374.5934 1376.2721 1377.2970 1378.9329 1400.8291 1405.6301 1418.0006 1430.3588 1441.9684 1460.0460 1460.8586 1462.2836 1463.5845 1465.7503 1470.8849 1474.9839 1479.0195 1479.8274 1484.9923 1486.0208 1487.6972 1494.1007 1498.8102 1502.3947 1554.6060 1579.4022 1592.3370 1619.3702 2798.4072 2842.4539 2858.5688 2971.6827 2972.7163 2977.9701 2990.6928 2993.9394 3015.4621 3018.9996 3031.0475 3042.6633 3066.8753 3067.5979 3069.0068 3074.8546 3076.1675 3077.8009 3078.1152 3081.2311 3088.4647 3128.3853 3132.3651 3141.2839 3153.9664 3164.8996 3173.8088 3183.0169
redmass: 3.2968 2.9672 3.2983 4.2364 4.5885 3.8985 2.6840 3.6809 3.4657 2.8250 3.5827 5.9058 1.7093 1.5788 1.1667 2.7557 3.2583 1.2843 1.1286 2.9054 3.2241 1.0604 2.8313 3.0522 2.3574 2.6747 2.9241 4.1042 3.3492 2.9641 5.2274 3.7655 3.1644 3.1692 3.7105 4.4637 3.4249 3.8136 3.4029 3.8705 4.8652 5.2617 6.4734 5.0115 2.7883 3.6828 1.4519 2.4750 1.6006 1.4636 3.7000 2.1543 1.4434 2.3692 1.4806 2.2010 1.7243 1.3795 1.6480 1.3187 1.2290 1.3123 3.6937 1.4418 1.3824 3.9928 2.2966 2.0664 4.0957 2.2888 2.1091 1.4154 1.8339 2.7387 2.3149 1.5671 1.6343 1.3492 1.3670 1.4115 2.9307 2.3837 1.7288 2.5454 1.5933 2.3479 2.4150 1.4095 1.4354 1.5020 1.2874 2.7044 1.5138 2.1217 1.8105 1.3844 1.2161 2.6355 3.6230 1.2052 1.1455 2.4011 1.1693 1.0508 1.0519 1.0652 1.0483 1.1556 2.2155 1.0750 1.0608 1.1013 1.0647 1.0540 1.0935 1.3601 1.1689 1.4072 6.6310 6.7449 6.6098 6.9907 1.0705 1.0575 1.0572 1.0350 1.0348 1.0359 1.0796 1.0660 1.0598 1.0721 1.0715 1.1012 1.0999 1.0997 1.1005 1.1037 1.0984 1.0996 1.1012 1.0991 1.1005 1.0886 1.0854 1.0911 1.0902 1.0970 1.0923 1.0945
irintensity: 0.2255 0.0010 0.1280 0.0650 0.9857 0.1002 1.0648 0.1998 0.8984 0.1154 0.1829 0.4579 0.1839 0.3032 1.5310 0.3826 1.0361 0.3938 0.2971 1.3852 2.8021 0.0372 3.6279 0.1469 5.3452 0.5051 0.6309 1.3007 0.4231 0.9137 0.8566 1.0926 5.3273 0.6091 5.1262 4.1233 9.0587 0.5503 0.8261 3.7932 7.0716 3.6769 2.1195 6.1730 9.5539 3.3683 90.6094 2.5786 17.1627 27.6946 28.3467 14.6266 0.3410 10.2154 9.8792 0.0652 3.2833 1.8449 2.3922 0.0704 0.2155 0.0092 10.3706 4.2735 0.0416 14.4393 10.9175 27.8087 0.9431 16.6609 18.4548 8.7768 30.6005 12.6719 4.0324 8.5133 9.4042 6.8359 12.2271 20.7077 6.9602 5.3031 41.3117 54.8278 12.1374 1.9900 110.6314 11.4227 32.2155 11.4038 7.9538 88.6318 17.1989 23.1366 22.0544 12.5692 21.0310 32.8764 13.6029 12.9271 2.6564 23.5998 4.6973 0.0046 17.3182 11.5716 0.5579 58.6146 264.6675 11.7105 17.8113 11.5223 10.4958 13.7710 33.7700 10.3178 64.0002 67.6538 1.5101 4.7783 25.5504 26.1279 89.4053 70.2670 196.5076 32.0078 32.2132 42.7467 8.0949 37.0331 26.9700 47.6702 43.1111 4.5501 4.1682 3.5616 15.6376 41.0992 146.3937 31.4462 44.0224 43.8030 47.6106 21.2641 0.3672 12.0054 4.6141 31.1402 14.3888 14.4013
temp: 298.150 k
press: 1.00000 atm
elementType: 16 7 7 6 6 6 6 6 6 6 6 6 6 6 6 6 6 6 6 6 6 6 6 6 1 1 1 1 1 1 1 1 1 1 1 1 1 1 1 1 1 1 1 1 1 1 1 1 1 1 1 1
symmnumber: 1
zpe: 1155209.0 jmol-1
zpe.correction: 0.439996 hartree
zpe.thermalcorrener: 0.463706 hartree
zpe.thermalcorrenthalpy: 0.464650 hartree
zpe.thermalcorrgfe: 0.386157 hartree
zpe.sumelectzpe: -1322.783152 hartree
zpe.sumelectthermal: -1322.759442 hartree
zpe.sumelectthermalent: -1322.758497 hartree
zpe.sumelectthermalfe: -1322.836991 hartree
dipole: 1.1003 -2.8745 -0.1109
dipole: 3.0799
quadrupole: -141.2245 -144.0285 -157.8176
quadrupole: -0.5820 -3.8622 3.4193
quadrupole: 6.4657 3.6618 -10.1274 -0.5820 -3.8622 3.4193
hfenergy: -1323.2231476 hartree
pointgroup: C01 [X(C21H28N2S1)]
dipole: 0.2534042 -1.1846315 -0.027069 debye
polarizability: 349.3651813|37.7459077|306.8019701|6.8879483|12.1380268|160.215184 unknown
InChI: InChI=1S/C21H28N2S/c1-21(2,3)16-11-12-18-20(15-16)24-19-10-7-6-9-17(19)23(18)14-8-13-22(4)5/h6-7,9-12,15H,8,13-14H2,1-5H3
charge 0 multiplicity 1
52 atoms
S  -1.083942 2.980086 -0.584155
N  0.924015 0.571898 -0.640054
N  3.922431 -3.424489 0.335219
C  -4.709163 -0.909637 0.166863
C  -3.235478 -0.495294 -0.048814
C  -0.448386 0.223222 -0.444965
C  1.850689 -0.489877 -1.093765
C  -1.466797 1.206315 -0.31866
C  -2.813934 0.856586 -0.098392
C  2.440058 -1.404018 0.017206
C  1.472349 1.810114 -0.189389
C  -4.817953 -1.772649 1.46033
C  -5.194931 -1.749464 -1.052959
C  -5.648829 0.314156 0.320358
C  -2.227029 -1.478051 -0.211401
C  -0.8717 -1.135313 -0.385324
C  0.663996 2.974232 -0.033403
C  3.072715 -2.66434 -0.609144
C  2.859537 1.940093 0.10699
C  1.204902 4.186393 0.43728
C  3.409352 3.16769 0.535519
C  2.58625 4.298157 0.716362
C  4.70849 -4.468513 -0.354606
C  3.172787 -3.974003 1.483524
H  1.303695 -1.114539 -1.824995
H  2.673388 -0.007779 -1.65311
H  3.217672 -0.876955 0.598174
H  1.642372 -1.675795 0.731259
H  -3.541474 1.665868 0.012893
H  -5.866389 -2.085577 1.625021
H  -4.197948 -2.684914 1.394553
H  -4.483443 -1.199433 2.344237
H  -4.582816 -2.659018 -1.190018
H  -6.245199 -2.065447 -0.90685
H  -5.136143 -1.158135 -1.984989
H  -5.643988 0.952418 -0.582768
H  -6.686552 -0.033183 0.4775
H  -5.370356 0.938098 1.189866
H  -2.490964 -2.541555 -0.189455
H  -0.14266 -1.943678 -0.47611
H  3.718462 -2.356288 -1.456436
H  2.257497 -3.306673 -1.044768
H  3.523222 1.078371 0.012775
H  0.543725 5.051123 0.560827
H  4.483627 3.22725 0.74152
H  3.003041 5.249043 1.062726
H  5.319355 -4.009062 -1.152303
H  4.076367 -5.268283 -0.819656
H  5.393832 -4.952563 0.363965
H  3.869952 -4.508108 2.15322
H  2.367002 -4.691669 1.179484
H  2.707593 -3.160614 2.065021
