program: Gaussian 09
title: 000114304
version: EM64L-G09RevD.01
frameworkgroup: C1[X(C9H9ClNO)]
method: RPBEPBE
basis: SDD
operation: Freq
keyword: #p
keyword: freq=noraman
keyword: PBEPBE/SDD
title: #p freq=noraman PBEPBE/SDD
converged: YES YES NO NO
title: Mulliken charges:
elementType: Cl O N C C C C C C C C C H H H H H H H H H
charge: 0.060627 -0.181095 -0.181422 0.307806 0.217550 0.407185 -0.297872 -0.617611 -0.288795 -0.750933 -0.148800 -0.125539 0.278479 0.285540 0.273468 0.285581 0.312565 0.284354 0.284093 0.306370 0.288448
chargesum: 1.00000
title: Mulliken charges with hydrogens summed into heavy atoms:
elementType: Cl O N C C C C C C C C C
charge: 0.060627 -0.181095 -0.181422 0.307806 0.217550 0.407185 -0.019393 0.226978 0.023770 0.123884 0.139648 -0.125539
polarizability: 1.87698622e+02 4.06036772e+00 1.09621847e+02 -1.11685816e-02 5.20277693e-03 5.16062365e+01
1716.lowfreq: -8.2339 -6.8016 -0.0026 -0.0024 -0.0013 8.6250 69.4951 85.5412 104.3846
frequency: 69.4044 85.5006 104.3441 135.5331 175.9510 217.9462 256.3038 292.7243 294.8385 357.0542 365.3952 424.4703 516.1816 539.0431 590.6644 611.1385 627.5440 673.6039 721.6610 728.1814 821.1126 856.9314 873.3386 876.6815 962.3032 980.6335 1037.3711 1038.6929 1079.2319 1127.0976 1147.4390 1153.6603 1168.7746 1242.2079 1285.9994 1348.1160 1393.7680 1407.8250 1412.6384 1433.8074 1449.0001 1454.1339 1458.5055 1473.1931 1479.1462 1556.1718 1604.8294 1629.3991 2998.1228 3021.9070 3078.7467 3120.2736 3132.0705 3148.8878 3174.1328 3189.8755 3198.9016
redmass: 1.0968 4.2234 1.0381 3.0565 5.4057 4.4489 3.0384 5.3108 4.1984 7.7298 5.7163 3.0130 5.0643 4.4797 4.4828 5.1698 4.7704 5.9454 4.8733 7.1231 1.3824 4.9093 4.8425 1.4019 1.3358 1.7651 1.4949 2.2010 3.0713 1.3416 1.7463 2.8618 1.9952 1.7771 2.2978 4.5652 4.5656 1.2531 3.5409 1.2578 1.0407 1.7846 1.6341 1.0381 1.0971 4.4933 8.2475 8.9836 1.0393 1.0343 1.0981 1.1040 1.0982 1.1022 1.0905 1.0983 1.0959
irintensity: 0.4810 1.4992 0.3965 0.5144 0.2828 3.2933 1.5063 0.0578 1.3819 5.1265 0.4086 10.3411 2.7330 4.7937 12.9750 4.1361 0.0002 3.5133 0.4259 13.1820 48.9050 65.4058 8.0936 22.4733 0.2412 4.6633 6.6408 25.0299 7.6933 0.3674 7.6773 4.9678 3.7403 29.8295 21.3333 48.2578 12.1176 47.5869 23.5015 6.3383 49.6403 46.3739 25.4551 7.5915 33.6419 63.4507 6.6738 69.5674 7.9799 1.7522 0.0341 0.9674 0.7212 1.1833 0.1636 2.3761 10.2828
temp: 298.150 k
press: 1.00000 atm
elementType: 17 8 7 6 6 6 6 6 6 6 6 6 1 1 1 1 1 1 1 1 1
symmnumber: 1
zpe: 422296.2 jmol-1
zpe.correction: 0.160844 hartree
zpe.thermalcorrener: 0.171896 hartree
zpe.thermalcorrenthalpy: 0.172840 hartree
zpe.thermalcorrgfe: 0.123492 hartree
zpe.sumelectzpe: -937.284887 hartree
zpe.sumelectthermal: -937.273835 hartree
zpe.sumelectthermalent: -937.272891 hartree
zpe.sumelectthermalfe: -937.322239 hartree
dipole: -8.4501 2.2538 0.0001
dipole: 8.7455
quadrupole: -33.5872 -57.4695 -75.7188
quadrupole: -0.3121 -0.0008 -0.0007
quadrupole: 22.0046 -1.8777 -20.1270 -0.3121 -0.0008 -0.0007
hfenergy: -937.4457309 hartree
pointgroup: C01 [X(C9H9Cl1N1O1)]
dipole: 3.2817789 -1.0334902 -0.0256359 debye
dipolederiv: -0.7415351 0.1190313 0.0069322 0.1979011 -0.0727568 -0.0013165 0.0063754 -0.0005059 0.0174102 -0.6898419 0.1974164 0.0045708 0.074141 -0.4474494 0.0022169 0.0053898 0.0006861 -0.0935766 -0.1433171 -0.0759429 0.0014336 0.0356816 -0.5203925 0.0032218 0.000146 0.0049646 -0.0659086 0.0150457 0.0313597 -0.0000037 0.1944051 -0.1419715 -0.0006987 -0.00126 0.0007529 0.0330615 0.6053725 -0.0018451 -0.0053127 -0.090036 0.0966044 0.0007768 -0.0046484 0.0000216 0.0843496 0.730017 0.1074732 -0.0062447 -0.1105387 0.8974446 -0.0047772 -0.0030093 -0.0065527 0.182121 0.176692 0.0119175 -0.0031224 0.1027568 0.1083644 -0.0028554 -0.0039633 -0.0018253 -0.1138613 0.1812027 -0.1611693 0.0009993 -0.2075368 0.3018231 0.001112 0.0013042 0.0004419 0.1523435 -0.4300489 0.0199311 0.0037725 -0.0994112 -0.0083426 0.0006811 0.0047799 -0.000576 -0.0516257 -0.4216571 -0.135484 0.0051432 0.0525473 -0.0383471 -0.0001076 0.001178 0.0008719 -0.011738 -0.3629183 0.1179256 0.0022741 0.3817453 0.0079551 -0.0044059 0.0001177 -0.0016695 -0.0495558 1.3227644 -0.2542097 -0.0124902 -0.4729907 0.1487029 0.0030361 -0.0107675 0.0008127 -0.0721755 0.0822149 0.0599004 0.0005254 0.0368196 0.0426005 0.0007283 0.0007412 0.0004264 0.1790236 0.1039018 -0.0162136 -0.0753252 0.0275141 0.0632096 -0.0266448 -0.0440384 -0.0498139 0.0260041 -0.0105242 -0.0137173 0.001732 -0.0828441 0.0742985 0.0013932 0.0023674 0.000527 0.1386857 0.1065591 -0.0141002 0.0736831 0.0287502 0.0644047 0.0254927 0.041833 0.0495321 0.0222964 0.1124215 -0.0051534 0.0008802 -0.0004664 0.1072128 0.0007047 0.0008726 0.0007616 0.1929181 0.0869632 -0.0051229 -0.0158569 -0.0384249 0.0938252 0.0781349 -0.0219136 0.061524 0.0492686 0.0879913 -0.0055893 0.0153871 -0.0390538 0.0904422 -0.078666 0.0228382 -0.0622648 0.0515346 0.1235036 0.0583774 -0.0003135 0.0237547 0.0454556 0.0011533 0.0004773 0.000885 0.162919 0.065193 -0.034785 0.0013357 -0.014714 0.0869163 0.0008203 0.0011798 0.0010005 0.1665055 unknown
polarizability: 187.8905106|0.5744841|109.4117641|-1.4021942|-0.472617|51.6244301 unknown
InChI: InChI=1S/C9H9ClNO/c1-6-11(2)8-4-3-7(10)5-9(8)12-6/h3-5H,1-2H3
charge 1 multiplicity 1
21 atoms
Cl -4.180132 0.591495 0.04385
O  1.037132 1.518338 -0.017667
N  1.649594 -0.634353 -0.006198
C  0.223845 -0.62887 0.00796
C  -0.15653 0.732515 0.000701
C  2.097372 0.6435 -0.021521
C  -0.744231 -1.650353 0.026625
C  2.482686 -1.855844 -0.00627
C  -1.477544 1.180066 0.010719
C  3.486142 1.161681 -0.039516
C  -2.092523 -1.236261 0.037055
C  -2.44015 0.144899 0.029194
H  -0.487999 -2.712817 0.032676
H  2.253033 -2.458117 -0.900161
H  3.547296 -1.583437 -0.019994
H  2.273065 -2.444694 0.901372
H  -1.749355 2.237472 0.00489
H  4.050829 0.836084 0.853102
H  4.035531 0.815667 -0.933926
H  3.463252 2.261597 -0.051802
H  -2.889815 -1.984268 0.051511
