program: Gaussian 09
title: 000114287
version: EM64L-G09RevD.01
frameworkgroup: C1[X(C12H16NOS)]
method: RPBEPBE
basis: SDD
operation: Freq
keyword: #p
keyword: freq=noraman
keyword: PBEPBE/SDD
title: #p freq=noraman PBEPBE/SDD
converged: YES YES NO NO
title: Mulliken charges:
elementType: S O N C C C C C C C C C C C C H H H H H H H H H H H H H H H H
charge: 0.389425 -0.235748 -0.149529 0.722806 -0.451056 -0.022864 -0.386266 -0.506582 0.374570 -0.420449 0.204130 -0.717134 -0.636574 -0.769678 -0.531410 0.259145 0.260147 0.270998 0.279854 0.271781 0.278507 0.276969 0.232481 0.260646 0.249341 0.261202 0.261902 0.225338 0.273787 0.237342 0.236920
chargesum: 1.00000
title: Mulliken charges with hydrogens summed into heavy atoms:
elementType: S O N C C C C C C C C C C C C
charge: 0.389425 -0.235748 -0.149529 0.722806 -0.451056 -0.022864 0.133026 -0.235583 0.374570 -0.140596 0.204130 0.110122 0.105894 -0.021236 0.216639
polarizability: 2.47344631e+02 9.75892477e+00 1.64761566e+02 3.99772217e+00 -4.29816986e+00 8.36747148e+01
1716.lowfreq: -0.0008 0.0004 0.0007 3.1404 6.2037 9.4759 59.2690 73.6083 93.7388
frequency: 59.2647 73.5939 93.7302 123.2181 140.0087 144.9847 148.5310 165.4356 191.6789 201.7056 227.7680 241.6682 270.5521 295.7063 317.3568 363.1496 370.3137 383.9330 428.5340 440.2405 451.1494 512.7361 555.7347 577.7309 605.3172 666.5203 671.3117 720.9658 733.8747 765.0162 806.9154 841.3052 870.5226 881.5417 958.4611 982.5039 1001.5120 1018.4811 1020.4128 1047.2345 1075.5549 1096.4003 1112.0957 1140.0418 1154.2649 1170.5611 1187.5288 1252.9226 1256.0407 1272.5136 1312.8544 1346.8863 1399.7325 1404.4752 1407.7285 1409.5887 1413.1264 1437.6648 1451.4068 1457.1245 1460.0472 1463.1562 1470.8651 1471.1163 1473.5097 1477.7836 1482.3038 1496.4593 1516.7229 1573.3340 1613.3380 2982.1754 2987.6281 2995.4351 3004.1346 3046.6050 3068.3161 3074.8040 3081.9228 3094.4904 3106.8799 3107.9415 3115.8107 3119.2493 3152.5495 3160.8841 3183.1225
redmass: 3.3953 2.7022 3.3235 2.2624 2.6336 1.1416 1.3597 2.9735 1.7377 1.2899 1.8306 2.0502 3.1873 3.3861 2.3404 5.0269 6.6559 4.6459 4.0185 2.8588 5.5446 5.6774 4.9811 5.3687 4.1023 5.2668 5.1314 3.6450 3.1782 3.4745 1.2958 1.5635 1.4015 3.7584 3.1361 2.3944 2.7806 1.6590 1.5332 1.5529 2.5954 2.0130 1.2580 1.7292 1.4325 2.8173 2.9548 2.6566 1.7757 1.3639 2.4188 1.5017 2.0293 1.2369 1.5537 1.7599 1.8916 1.3670 1.0436 1.1609 1.0562 1.1358 1.5981 1.0878 1.0489 1.3782 1.1109 1.7929 1.8713 8.9979 6.3457 1.0324 1.0400 1.0373 1.0365 1.0617 1.0973 1.0964 1.1055 1.1018 1.1003 1.1009 1.0989 1.1020 1.1009 1.0925 1.0925
irintensity: 2.4060 0.0616 2.6045 0.1888 2.3155 0.1222 4.1018 3.4667 1.6444 0.2428 0.4819 1.2280 1.3302 0.0942 0.1496 3.4128 0.8938 2.7147 1.2419 7.9697 10.9075 8.5431 5.1367 1.9385 3.7635 0.5133 3.5779 2.8664 0.0867 12.3090 1.9890 23.7383 21.6332 4.6494 7.0249 32.7748 50.3973 3.1011 6.8707 8.2552 6.0089 14.2627 0.0031 8.7928 5.1380 18.8948 4.9792 227.4297 38.6136 16.7538 32.3735 26.6034 7.6710 9.3171 22.6953 32.9735 9.2837 38.7032 16.0476 34.4911 31.5013 78.3437 3.2182 24.6680 20.4167 37.2966 16.9491 42.8733 53.9400 19.1100 103.7346 33.8106 0.3515 5.2095 5.4312 9.3990 1.2345 4.5964 26.8263 2.1778 9.6054 13.5051 4.2940 11.4611 6.9190 1.7015 0.6098
temp: 298.150 k
press: 1.00000 atm
elementType: 16 8 7 6 6 6 6 6 6 6 6 6 6 6 6 1 1 1 1 1 1 1 1 1 1 1 1 1 1 1 1
symmnumber: 1
zpe: 669368.8 jmol-1
zpe.correction: 0.254949 hartree
zpe.thermalcorrener: 0.270737 hartree
zpe.thermalcorrenthalpy: 0.271681 hartree
zpe.thermalcorrgfe: 0.212642 hartree
zpe.sumelectzpe: -993.569201 hartree
zpe.sumelectthermal: -993.553413 hartree
zpe.sumelectthermalent: -993.552469 hartree
zpe.sumelectthermalfe: -993.611508 hartree
dipole: -4.0822 -0.3290 -0.2222
dipole: 4.1015
quadrupole: -40.3090 -72.2130 -95.5893
quadrupole: -8.2405 2.6404 -1.5591
quadrupole: 29.0614 -2.8425 -26.2189 -8.2405 2.6404 -1.5591
hfenergy: -993.8241504 hartree
pointgroup: C01 [X(C12H16N1O1S1)]
dipole: 1.5986842 0.1893626 -0.1105731 debye
polarizability: 246.3677168|13.1758349|162.9854898|-7.2275871|14.2097134|86.4277048 unknown
InChI: InChI=1S/C12H16NOS/c1-5-13-9(3)15-12-7-11(14-4)8(2)6-10(12)13/h6-7H,5H2,1-4H3
charge 1 multiplicity 1
31 atoms
S  1.269645 2.207624 0.512333
O  -3.618431 0.012611 0.376027
N  1.949389 -0.230495 -0.144342
C  0.533197 -0.293623 -0.032709
C  -0.033739 0.957441 0.317958
C  2.497613 0.981727 0.106895
C  2.766785 -1.446381 -0.462002
C  -0.302291 -1.41819 -0.241855
C  -1.691994 -1.289054 -0.09924
C  -1.417516 1.131638 0.472601
C  -2.241085 -0.00195 0.261607
C  3.954038 1.310811 0.049024
C  2.998889 -2.327028 0.781037
C  -2.626979 -2.454867 -0.312783
C  -4.295568 1.272623 0.739941
H  2.23167 -1.997233 -1.253666
H  3.723177 -1.108196 -0.890519
H  0.114996 -2.391927 -0.51398
H  -1.839917 2.102067 0.741564
H  4.552074 0.629405 0.681004
H  4.341604 1.243254 -0.985568
H  4.135014 2.337905 0.401658
H  3.564663 -1.788473 1.560516
H  3.58478 -3.215392 0.489149
H  2.049178 -2.674006 1.221055
H  -3.213941 -2.661369 0.600252
H  -3.364355 -2.22717 -1.103176
H  -2.07838 -3.368316 -0.593639
H  -5.363307 1.018288 0.768576
H  -4.113927 2.049245 -0.025468
H  -3.965082 1.620932 1.73575
