program: Gaussian 09
title: 000114222
version: EM64L-G09RevD.01
frameworkgroup: C1[X(C16H24O2)]
method: RPBEPBE
basis: SDD
operation: Freq
keyword: #pfreq=noraman
keyword: PBEPBE/SDD
title: #p freq=noraman PBEPBE/SDD
converged: YES YES NO NO
title: Mulliken charges:
elementType: O O C C C C C C C C C C C C C C C C H H H H H H H H H H H H H H H H H H H H H H H H
charge: -0.432868 -0.222119 -0.386578 -0.381935 -0.366096 -0.372044 -0.387466 -0.353885 -0.575556 -0.356269 0.537808 -0.696418 -0.537447 -0.386324 0.240704 -0.379439 0.163305 -0.213363 0.193799 0.196878 0.193413 0.191946 0.192161 0.196208 0.190550 0.189308 0.206042 0.215793 0.188377 0.187443 0.205719 0.215982 0.194513 0.195368 0.215290 0.210035 0.209335 0.281862 0.239131 0.220543 0.212655 0.363638
chargesum: 0.00000
title: Mulliken charges with hydrogens summed into heavy atoms:
elementType: O O C C C C C C C C C C C C C C C C
charge: -0.069230 -0.222119 0.004099 0.003424 0.022273 0.007815 0.034370 0.021935 -0.153855 0.033611 0.537808 -0.061757 -0.255585 -0.147193 0.240704 -0.158896 0.163305 -0.000709
polarizability: 2.40628724e+02 6.55710974e+00 1.83515238e+02 -2.35806915e+01 7.07778664e+00 1.30552832e+02
1716.lowfreq: -6.6826 -0.0008 -0.0001 0.0009 2.6767 13.6683 14.9628 25.6266 36.0920
frequency: 14.5806 25.4391 34.2883 52.6450 64.0747 73.2933 96.9963 115.9234 117.4436 139.2478 142.7207 147.1333 153.1704 182.3848 191.8488 222.9143 227.6450 291.9601 299.6463 341.0795 363.5479 365.2883 384.1140 448.6754 455.7447 464.1800 503.5471 531.5151 592.6701 623.4628 721.7332 723.1127 726.2364 739.1135 745.9381 766.2865 795.4915 814.6595 817.1263 878.8651 886.8439 928.9619 940.2543 955.1296 958.5081 990.0887 994.0135 1001.2864 1012.0762 1036.3703 1051.7745 1067.1427 1072.2927 1077.3890 1079.5566 1099.0584 1120.0208 1154.8937 1165.0922 1184.4433 1209.1938 1213.9130 1234.9325 1244.3153 1246.6457 1249.1073 1272.1336 1279.2061 1280.3982 1286.0209 1290.9974 1293.9366 1297.9232 1312.5366 1334.7001 1348.1945 1353.6221 1354.7149 1374.1917 1387.4057 1401.7041 1425.3899 1461.0125 1461.2378 1465.0776 1466.0446 1471.0646 1475.5485 1476.9106 1482.8218 1488.0132 1490.1723 1490.9118 1584.6392 1600.5300 1627.2165 2949.0049 2949.8654 2951.2426 2954.6782 2956.0402 2961.2187 2967.2724 2968.9341 2971.1558 2980.2014 2983.6303 2988.2674 2996.1949 3007.5751 3018.1735 3028.5096 3039.4718 3049.8020 3067.5668 3070.1016 3111.4997 3133.8694 3138.1348 3584.9032
redmass: 4.9670 4.4422 3.2223 1.7971 4.1937 2.2399 1.9235 2.3714 3.3358 4.0484 2.0972 1.9946 4.6770 3.5007 3.8570 1.2274 2.6485 3.6115 3.5562 3.7424 1.4751 2.2083 3.6740 3.0115 3.7211 3.0669 4.5747 4.2687 3.5102 6.0780 1.0743 3.8066 1.0816 1.1048 3.9153 1.1677 4.8782 1.4292 1.3303 1.2610 1.9024 1.5917 1.6834 1.4436 1.6415 4.0485 3.8521 1.8666 1.1478 3.4858 3.0743 2.7116 1.8995 2.1489 2.2873 1.4561 2.6957 1.5869 1.2686 1.8165 1.2774 1.5017 1.7819 2.4444 1.3377 1.6315 1.2424 1.0364 1.2960 1.1366 1.1924 1.1262 1.2551 1.4066 1.4327 1.5356 1.6834 1.6271 1.6902 1.2172 3.4976 3.3766 1.0737 1.0742 1.0654 1.0808 1.0830 1.0447 1.0817 1.0914 1.0977 1.1049 2.7764 6.8830 6.1929 6.6009 1.0587 1.0588 1.0592 1.0594 1.0869 1.0591 1.0592 1.0585 1.0369 1.0609 1.0961 1.0977 1.1002 1.1021 1.1030 1.1044 1.1047 1.1045 1.1008 1.0992 1.0875 1.0924 1.0956 1.0662
irintensity: 1.3221 0.5204 0.7259 0.3676 0.2577 0.1270 0.2146 0.1233 0.2439 0.0882 0.2026 0.0806 1.2436 11.1002 8.4736 0.8193 5.6975 2.2005 3.8964 0.5243 92.2660 46.7864 0.0910 3.9540 2.3458 1.6577 24.3054 3.6809 19.1918 16.7148 13.6308 6.7290 0.0296 4.9945 10.6319 0.1146 16.2179 28.8463 12.0451 0.9085 4.7886 5.5302 8.1342 1.2895 3.4828 0.3407 0.2849 9.2086 0.5307 0.7159 1.0861 2.5295 88.1872 0.0559 0.4289 52.8697 19.2975 66.6277 24.9966 0.0718 17.3970 2.0578 3.4251 38.5947 1.4932 17.3814 7.1950 0.5982 5.7731 6.1586 19.0287 2.7191 39.1425 2.6268 0.8301 0.5848 0.3277 0.3723 0.2975 11.2638 51.7632 85.9485 0.0395 0.0593 0.0207 0.7108 0.2690 11.7682 2.4096 0.9312 1.4028 42.2377 83.1210 132.2650 96.7420 30.9346 0.9096 0.2758 2.9234 0.1006 69.3044 36.1475 0.4953 175.2129 35.4120 78.5820 1.9228 1.4659 0.8503 0.8326 0.6316 0.4370 92.4589 128.3235 101.0078 55.1936 17.1170 5.9891 15.4736 47.0692
temp: 298.150 k
press: 1.00000 atm
elementType: 8 8 6 6 6 6 6 6 6 6 6 6 6 6 6 6 6 6 1 1 1 1 1 1 1 1 1 1 1 1 1 1 1 1 1 1 1 1 1 1 1 1
symmnumber: 1
zpe: 949420.1 jmol-1
zpe.correction: 0.361615 hartree
zpe.thermalcorrener: 0.382105 hartree
zpe.thermalcorrenthalpy: 0.383049 hartree
zpe.thermalcorrgfe: 0.309309 hartree
zpe.sumelectzpe: -773.149484 hartree
zpe.sumelectthermal: -773.128993 hartree
zpe.sumelectthermalent: -773.128049 hartree
zpe.sumelectthermalfe: -773.201790 hartree
dipole: -1.0197 -5.3957 -0.7748
dipole: 5.5456
quadrupole: -111.6091 -114.2501 -111.0135
quadrupole: -27.9294 -7.9384 2.3546
quadrupole: 0.6818 -1.9592 1.2774 -27.9294 -7.9384 2.3546
hfenergy: -773.5110987 hartree
pointgroup: C01 [X(C16H24O2)]
dipole: 0.3997989 2.1135196 -0.3654389 debye
polarizability: 240.5531825|7.2968011|183.0755907|23.5357963|-8.5633323|131.0680207 unknown
InChI: InChI=1S/C16H24O2/c1-2-3-4-5-6-7-8-9-14-10-11-16(18)15(12-14)13-17/h10-13,18H,2-9H2,1H3
charge 0 multiplicity 1
42 atoms
O  -6.09622 0.545278 -1.242242
O  -4.637472 -3.004338 0.216038
C  2.766606 0.171247 -0.128875
C  4.173413 0.118257 0.508865
C  1.632806 0.359482 0.904396
C  5.305426 -0.068681 -0.526795
C  0.22829 0.385974 0.26256
C  6.712835 -0.137365 0.107933
C  -0.908501 0.579479 1.305227
C  7.842903 -0.323915 -0.930671
C  -2.289488 0.583448 0.66909
C  9.24567 -0.396247 -0.28936
C  -3.039781 -0.602931 0.531143
C  -2.848808 1.783186 0.147527
C  -4.309322 -0.625291 -0.105599
C  -4.106225 1.796834 -0.48939
C  -4.838601 0.593295 -0.619174
C  -5.061701 -1.897522 -0.224656
H  2.729985 0.998355 -0.868465
H  2.588934 -0.763868 -0.699947
H  4.210576 -0.711733 1.245181
H  4.352294 1.051393 1.083271
H  1.799995 1.302458 1.46648
H  1.678616 -0.460159 1.651808
H  5.120382 -0.997131 -1.10682
H  5.273803 0.765739 -1.258575
H  0.176202 1.200347 -0.488789
H  0.053165 -0.558917 -0.290236
H  6.746537 -0.97329 0.837856
H  6.900551 0.789859 0.689206
H  -0.734151 1.530739 1.846327
H  -0.840204 -0.232235 2.055227
H  7.809487 0.51276 -1.65821
H  7.652368 -1.24897 -1.512398
H  10.035154 -0.52921 -1.051971
H  9.31385 -1.243639 0.418932
H  9.471874 0.528989 0.273897
H  -2.662587 -1.557313 0.918474
H  -2.290928 2.722407 0.246584
H  -4.516283 2.737909 -0.87889
H  -6.046853 -1.826566 -0.736948
H  -6.369095 1.440984 -1.560708
