program: Gaussian 09
title: 000114129
version: EM64L-G09RevD.01
frameworkgroup: C1[X(C8H14O2)]
method: RPBEPBE
basis: SDD
operation: Freq
keyword: #pfreq=noraman
keyword: PBEPBE/SDD
title: #p freq=noraman PBEPBE/SDD
converged: YES YES NO NO
title: Mulliken charges:
elementType: O O C C C C C C C C H H H H H H H H H H H H H H
charge: -0.267974 -0.236798 0.232796 -0.513857 -0.736371 -0.709502 -0.067678 0.251918 -0.592737 -0.504271 0.227916 0.228774 0.244052 0.207680 0.209310 0.212517 0.215723 0.228952 0.220202 0.211256 0.222814 0.241303 0.230082 0.243893
chargesum: 0.00000
title: Mulliken charges with hydrogens summed into heavy atoms:
elementType: O O C C C C C C C C
charge: -0.267974 -0.236798 0.232796 -0.057167 -0.075330 -0.052310 0.152523 0.251918 -0.158666 0.211008
polarizability: 9.43244980e+01 2.09873494e+00 9.31265884e+01 2.67627946e+00 2.49177344e+00 8.65243825e+01
1716.lowfreq: -5.7010 -0.0005 -0.0004 0.0005 7.4371 12.3737 22.5112 72.5795 82.5286
frequency: 21.8854 72.5313 82.4481 92.5862 117.3309 202.9595 217.2268 244.9217 254.0217 278.5361 292.0066 310.4014 362.6743 398.0235 421.7623 493.4237 603.1995 668.6307 697.6022 751.9290 784.9167 888.1869 894.4584 936.4240 939.3070 962.6887 973.3829 1001.1468 1009.5281 1044.9964 1102.3395 1111.7511 1148.2081 1162.7618 1180.7481 1231.4093 1286.2250 1300.1952 1320.1566 1376.5850 1393.9898 1421.0527 1423.7651 1444.2056 1451.0240 1463.7815 1465.8532 1469.3971 1480.0505 1489.8631 1640.5767 1656.0539 2971.3874 2984.8896 3003.6074 3013.5502 3065.5657 3072.7015 3075.4021 3082.6472 3085.4081 3096.0262 3101.4367 3104.9607 3147.4261 3199.6167
redmass: 4.4395 2.8915 2.6194 1.2474 2.8496 3.3973 1.0902 3.0283 1.1886 2.1393 2.3556 2.5990 2.7001 2.1296 2.0866 3.0549 3.7761 2.2719 3.1122 3.6342 4.1885 2.1375 2.1264 1.4703 1.3553 1.7213 4.4909 1.2395 1.2759 1.5540 1.7872 1.2685 1.4394 2.4661 2.6141 2.8339 1.3499 1.6786 1.4409 1.1948 1.2181 1.1790 1.1785 1.0954 1.0505 1.0506 1.0507 1.0576 1.0503 1.0683 9.1304 4.7416 1.0350 1.0363 1.0294 1.0580 1.0995 1.0957 1.0872 1.0989 1.1025 1.0988 1.0708 1.1044 1.1048 1.1142
irintensity: 1.2555 0.4567 0.3202 0.6278 1.1543 7.7983 0.2161 6.8598 0.3307 1.1712 5.1005 0.1923 4.1517 1.3795 1.5357 1.4805 4.2821 15.6099 0.6994 3.2522 16.4484 4.4954 0.3005 6.7233 65.9817 1.2768 35.7858 2.7453 28.6106 11.5867 93.7971 0.0124 6.3623 5.3873 67.7513 115.1793 2.3157 29.6841 0.9006 15.1641 15.1642 17.7123 16.8092 4.9190 13.4741 10.8130 4.7557 5.8661 9.3459 12.3307 173.0733 20.0307 32.5866 24.4078 32.2114 16.9589 16.5138 25.6427 7.6101 48.2766 26.9126 26.7031 5.6719 26.6299 16.3405 23.1504
temp: 298.150 k
press: 1.00000 atm
elementType: 8 8 6 6 6 6 6 6 6 6 1 1 1 1 1 1 1 1 1 1 1 1 1 1
symmnumber: 1
zpe: 532599.9 jmol-1
zpe.correction: 0.202857 hartree
zpe.thermalcorrener: 0.215314 hartree
zpe.thermalcorrenthalpy: 0.216258 hartree
zpe.thermalcorrgfe: 0.163759 hartree
zpe.sumelectzpe: -462.867314 hartree
zpe.sumelectthermal: -462.854857 hartree
zpe.sumelectthermalent: -462.853913 hartree
zpe.sumelectthermalfe: -462.906412 hartree
dipole: -0.2135 -1.0534 1.5318
dipole: 1.8712
quadrupole: -57.0543 -60.8058 -63.5186
quadrupole: 0.4561 5.3601 3.5090
quadrupole: 3.4053 -0.3462 -3.0590 0.4561 5.3601 3.5090
hfenergy: -463.0701709 hartree
pointgroup: C01 [X(C8H14O2)]
dipole: -0.0534706 0.5310295 -0.5070939 debye
dipolederiv: -0.9505706 -0.0143786 0.4052921 -0.0118814 -0.4306705 0.1758974 0.5469645 0.1738775 -0.7700348 -0.575029 0.1761612 -0.1075998 0.0906385 -0.6268213 0.3839205 0.1452497 0.1973162 -0.6292401 0.3235936 0.048509 0.069274 0.0896916 0.0507717 0.0137104 0.1505148 -0.093005 0.1126113 -0.3349448 0.1122724 -0.0415771 0.09134 -0.0150102 -0.0098729 -0.0537745 0.0562889 0.0230325 -0.0106458 0.0013316 0.029081 -0.0115179 0.0220696 0.0188838 0.0113856 0.0280255 -0.0903582 -0.0475418 -0.0110159 0.0031636 -0.0040705 0.0007667 -0.0484441 -0.0176336 0.0217952 0.052063 -0.2184041 0.0678455 0.0178109 0.099219 0.2353618 0.0488811 -0.0137822 -0.0304047 0.0931197 1.1031313 -0.1677556 -0.2492904 -0.170206 0.7193004 -0.6280821 -0.6831412 -0.4266065 0.9785276 -0.4010512 0.0193167 -0.0370348 0.0300196 -0.1083317 -0.1323477 -0.0300514 -0.1388265 0.0044841 0.5413603 -0.0167128 -0.124173 -0.1015921 0.2416422 0.0751651 -0.1166761 0.0280637 0.304229 0.0494837 -0.0454601 -0.0094587 -0.0255823 -0.1163413 0.0017733 0.0267341 0.0341044 0.0891458 0.0364984 0.0194415 0.0544371 0.0268264 0.07837 0.0483321 0.0383911 0.0022928 -0.099667 -0.0191508 0.0664702 0.0935507 0.0930629 0.0399414 -0.0500652 0.096309 -0.0352987 0.0372368 0.0940035 -0.0376946 0.0072828 -0.0322849 -0.1716687 0.0436309 0.0069998 -0.0136611 0.0826381 -0.0931204 -0.0341986 -0.1280038 -0.0583011 0.0823517 -0.0478233 -0.1042987 -0.0157744 -0.0082116 0.0737563 -0.0419344 0.0196381 -0.0087703 -0.2014287 -0.0311333 0.0164482 0.0005545 0.0821482 0.0684067 0.0014372 0.0159604 -0.0064207 0.0757827 0.0898901 0.0799552 0.0504098 -0.1454226 -0.1096108 -0.0031175 -0.0807132 -0.0321858 0.0837968 -0.0325786 -0.1225178 -0.0221071 0.0185489 0.1345451 -0.0128728 0.0008728 -0.0171251 0.018948 0.0249423 0.0143438 0.073897 -0.1160819 0.1880607 -0.0499288 0.0081411 -0.0624916 -0.1186074 0.0242013 0.0079719 0.0476909 0.0661787 0.1717581 -0.0060575 0.0139754 -0.0097923 0.0830197 0.0711153 0.0099755 0.0436481 -0.0897213 -0.0737802 0.005013 -0.0310468 0.0422242 0.0870692 -0.0438441 -0.1296854 -0.0244631 -0.0327015 0.0434537 -0.0096043 0.0630394 -0.0360017 0.0590377 0.0917108 0.1108535 0.0707896 -0.0420256 0.0057981 -0.0670668 0.0073781 0.0252017 -0.0893501 -0.0878631 0.0094642 -0.0286068 0.0795007 unknown
polarizability: 94.0770115|-1.637478|92.0905248|-2.8501006|3.7883145|87.8079326 unknown
InChI: InChI=1S/C8H14O2/c1-5-8(2,3)6-7(9)10-4/h5H,1,6H2,2-4H3
charge 0 multiplicity 1
24 atoms
O  1.972315 0.579675 -0.458498
O  1.621863 -0.886074 1.315519
C  -1.249178 0.486621 0.010854
C  -0.006464 0.921675 0.883048
C  -1.051082 0.900582 -1.465826
C  -2.486883 1.235786 0.594264
C  -1.476117 -1.01405 0.187702
C  1.246814 0.10126 0.642484
C  -1.628645 -1.939093 -0.791327
C  3.20245 -0.181307 -0.788316
H  0.20363 1.987283 0.682085
H  -0.263317 0.802419 1.950732
H  -0.163646 0.418877 -1.909567
H  -0.910434 1.994577 -1.539672
H  -1.938755 0.632586 -2.067314
H  -2.324493 2.330383 0.582853
H  -2.688244 0.928356 1.637394
H  -3.386711 1.012142 -0.005826
H  -1.522114 -1.346063 1.237466
H  -1.799783 -2.994154 -0.549589
H  -1.580481 -1.681668 -1.855314
H  3.914998 -0.136934 0.052579
H  3.609527 0.315723 -1.680035
H  2.955851 -1.236303 -0.994794
