program: Gaussian 09
title: 000114126
version: EM64L-G09RevD.01
frameworkgroup: C1[X(C20H13NO3)]
method: RPBEPBE
basis: SDD
operation: Freq
keyword: #p
keyword: freq=noraman
keyword: PBEPBE/SDD
title: #p freq=noraman PBEPBE/SDD
converged: YES YES NO NO
title: Mulliken charges:
elementType: O O O N C C C C C C C C C C C C C C C C C C C C H H H H H H H H H H H H H
charge: -0.329605 -0.392216 -0.162523 -0.007557 0.408676 0.452051 0.187397 -0.514041 -0.626302 0.143780 -0.135805 0.450628 0.373784 -0.424820 -0.419182 0.130738 -0.247531 -0.431591 -0.235654 -0.389399 -0.320289 -0.215460 -0.177939 -0.374678 0.279920 0.227628 0.248249 0.239076 0.236849 0.256487 0.230651 0.228586 0.245171 0.231706 0.230593 0.244455 0.358167
chargesum: 0.00000
title: Mulliken charges with hydrogens summed into heavy atoms:
elementType: O O O N C C C C C C C C C C C C C C C C C C C C
charge: -0.329605 -0.034049 -0.162523 -0.007557 0.408676 0.452051 0.187397 -0.234121 -0.398674 0.143780 -0.135805 0.450628 0.373784 -0.176572 -0.180106 0.130738 -0.016880 -0.194742 -0.007068 -0.132912 -0.075118 0.016245 0.052655 -0.130223
polarizability: 3.50365065e+02 -2.80190020e+01 2.19265444e+02 -5.64405948e+00 6.38515475e+00 1.79974740e+02
1716.lowfreq: -10.8315 -6.2871 -0.0008 -0.0007 0.0004 4.4451 15.4058 21.2917 42.6063
frequency: 14.6230 21.0034 42.5879 68.5514 83.0264 115.0028 119.4359 164.8294 177.0215 209.1351 235.8453 274.5589 286.6011 291.9976 305.0047 355.4954 385.6603 415.2510 422.5701 428.0043 454.5310 469.1671 471.0036 476.6567 519.5053 541.0034 542.1878 553.8430 584.4259 600.5331 620.9627 636.2927 640.4602 689.1654 719.3493 739.1068 750.4789 757.8206 769.5886 775.0143 798.5812 802.9382 813.2798 837.2814 847.6353 859.5893 884.0628 903.8314 907.8048 932.4085 935.1599 944.2647 968.8907 977.0112 990.1125 990.9246 1022.0829 1023.9550 1040.3742 1068.4113 1094.6193 1131.0777 1138.4389 1169.8199 1173.2725 1183.4738 1197.8735 1218.7466 1237.2490 1242.6294 1265.9044 1277.8060 1296.3060 1331.1681 1343.6085 1374.4513 1400.4890 1407.9280 1427.1711 1432.4120 1437.2659 1452.0058 1468.0350 1493.3910 1527.1189 1561.8977 1577.9238 1589.7344 1600.5313 1623.8498 1639.4358 1677.2693 3109.2699 3121.5919 3125.2908 3128.5619 3128.8505 3133.0070 3144.3108 3152.8499 3163.8596 3167.5533 3169.7597 3173.5030 3564.0925
redmass: 5.3470 5.9782 5.5281 7.0913 7.6227 5.7366 5.6141 5.6556 4.4613 5.9266 5.2008 4.9877 5.7452 5.4015 6.0991 4.6542 1.2532 3.9513 5.3292 4.4936 5.3471 3.1912 6.3119 2.6580 6.2065 5.5204 4.4406 4.8338 6.0264 6.2381 6.7518 3.9324 5.1770 6.1953 5.6290 5.3547 3.6456 1.3307 1.6849 2.2890 3.6163 2.4034 3.5205 1.4618 2.6087 5.8323 1.6475 4.6935 1.5087 3.7185 1.9589 1.4369 1.4411 1.3462 1.3932 1.3449 2.2749 3.2910 2.8099 2.3324 2.7191 1.5702 1.3933 1.2869 1.0791 1.5066 1.3819 2.0091 1.8110 2.1364 2.2539 2.0405 2.5287 1.9663 5.1321 1.8752 2.3991 5.8684 3.5226 5.9918 2.9240 2.7966 2.5246 3.9930 3.9898 7.4456 7.4113 5.7542 6.2188 7.1974 7.0597 12.5789 1.0911 1.0860 1.0884 1.0879 1.0887 1.0911 1.0951 1.0931 1.1003 1.0991 1.0921 1.0974 1.0659
irintensity: 0.3035 1.9662 2.2365 0.8495 0.3081 0.8118 0.5404 1.3408 3.6909 0.4440 0.6370 0.6605 0.5271 5.7267 0.4617 10.8031 106.7938 4.0104 3.8001 4.7542 8.5677 0.1743 17.8104 36.4060 9.3520 3.3946 2.3445 2.4509 12.0939 2.3328 3.2492 7.5816 6.6304 4.0846 13.3797 3.2174 10.9988 45.6064 28.5117 11.4571 16.1845 29.4780 26.4934 33.7026 58.3697 20.1068 24.9470 4.6939 0.1819 304.5652 109.5270 0.4414 10.4443 0.8007 1.9215 0.0061 6.8699 51.1283 113.3988 87.3391 263.5375 118.6549 17.4303 92.8003 2.7420 169.6549 68.7858 2.3935 24.5591 23.8892 31.9482 15.7793 11.8116 41.0174 4.7984 50.3188 8.4420 19.4349 0.7029 8.0361 16.9128 50.9327 13.7894 33.9284 25.9723 27.1617 8.0803 5.5435 23.8439 9.9797 74.3256 329.2845 16.3455 5.1919 9.5744 2.1694 0.2426 14.3901 31.3314 27.2555 36.6317 32.2427 0.4054 9.0403 39.9892
temp: 298.150 k
press: 1.00000 atm
elementType: 8 8 8 7 6 6 6 6 6 6 6 6 6 6 6 6 6 6 6 6 6 6 6 6 1 1 1 1 1 1 1 1 1 1 1 1 1
symmnumber: 1
zpe: 721056.9 jmol-1
zpe.correction: 0.274636 hartree
zpe.thermalcorrener: 0.293208 hartree
zpe.thermalcorrenthalpy: 0.294152 hartree
zpe.thermalcorrgfe: 0.225944 hartree
zpe.sumelectzpe: -1048.736975 hartree
zpe.sumelectthermal: -1048.718404 hartree
zpe.sumelectthermalent: -1048.717460 hartree
zpe.sumelectthermalfe: -1048.785667 hartree
dipole: 0.4302 -1.5402 0.4267
dipole: 1.6551
quadrupole: -94.8215 -128.0371 -133.0469
quadrupole: 11.0957 -6.6632 2.7569
quadrupole: 23.8137 -9.4019 -14.4118 11.0957 -6.6632 2.7569
hfenergy: -1049.0116115 hartree
pointgroup: C01 [X(C20H13N1O3)]
dipole: 0.1596892 -0.581389 0.2460076 debye
polarizability: 348.4813977|-32.0575625|221.9431703|-6.1141543|1.6414607|179.1806815 unknown
InChI: InChI=1S/C20H13NO3/c22-17-12-15-6-2-1-5-14(15)11-16(17)20(23)24-18-9-3-7-13-8-4-10-21-19(13)18/h1-12,22H
charge 0 multiplicity 1
37 atoms
O  -0.773271 0.871762 0.879049
O  1.838345 2.770602 -1.767209
O  -0.786209 1.827294 -1.268968
N  -2.088601 -1.013543 -0.726439
C  3.066261 -0.647314 0.440531
C  4.045466 0.092224 -0.330547
C  1.290885 0.90061 -0.322342
C  1.706694 -0.212078 0.421699
C  3.616582 1.234576 -1.075494
C  2.276607 1.636784 -1.078777
C  -2.848231 -0.209413 0.108785
C  -4.288437 -0.322282 0.216736
C  -2.182721 0.776516 0.917447
C  3.485595 -1.791996 1.195732
C  5.411549 -0.344381 -0.312372
C  -0.151456 1.261273 -0.366422
C  4.822676 -2.194432 1.195831
C  -5.001704 0.517972 1.131106
C  5.790738 -1.46266 0.43458
C  -2.893125 1.580599 1.806604
C  -4.930446 -1.298798 -0.61374
C  -4.311646 1.444752 1.915473
C  -4.161402 -2.092253 -1.466442
C  -2.739242 -1.917997 -1.481033
H  0.951246 -0.764491 0.987611
H  4.360318 1.805836 -1.647452
H  2.737507 -2.346604 1.774301
H  6.157412 0.211191 -0.893236
H  -6.091331 0.423736 1.206607
H  -2.35029 2.315594 2.408227
H  5.137694 -3.068829 1.774982
H  6.837379 -1.787044 0.441083
H  -6.020051 -1.410305 -0.567751
H  -4.854576 2.086195 2.617481
H  -4.6210 -2.844026 -2.115387
H  -2.116034 -2.541021 -2.133547
H  2.591621 3.202049 -2.244007
