program: Gaussian 09
title: 000114086
version: EM64L-G09RevD.01
frameworkgroup: C1[X(C20H15NO3)]
method: RPBEPBE
basis: SDD
operation: Freq
keyword: #p
keyword: freq=noraman
keyword: PBEPBE/SDD
title: #p freq=noraman PBEPBE/SDD
converged: YES YES NO NO
title: Mulliken charges:
elementType: O O O N C C C C C C C C C C C C C C C C C C C C H H H H H H H H H H H H H H H
charge: -0.256828 -0.399018 -0.435443 0.022974 0.273597 0.375744 0.285040 -0.066316 0.184883 -0.435517 -0.407447 -0.393020 -0.430866 -0.492879 0.334775 -0.267961 -0.214194 0.455850 -0.346862 -0.437052 -0.240910 -0.322502 -0.178357 -0.374139 0.258054 0.198579 0.264212 0.239668 0.196712 0.232001 0.233421 0.255163 0.233495 0.226479 0.242969 0.367905 0.228468 0.241409 0.347910
chargesum: 0.00000
title: Mulliken charges with hydrogens summed into heavy atoms:
elementType: O O O N C C C C C C C C C C C C C C C C C C C C
charge: -0.256828 -0.031113 -0.087533 0.022974 0.273597 0.375744 0.285040 -0.066316 0.184883 -0.177462 -0.208867 -0.128808 -0.191197 -0.064166 0.334775 -0.034539 -0.214194 0.455850 -0.091699 -0.203557 -0.014431 -0.079533 0.050111 -0.132730
polarizability: 3.91087869e+02 -2.15715750e+01 2.16859713e+02 -1.62916398e+01 6.85276707e+00 1.55602039e+02
1716.lowfreq: -1.4362 0.0005 0.0006 0.0009 3.8957 5.8867 21.4025 22.5291 38.8332
frequency: 21.3298 22.4955 38.8088 70.7230 86.8962 110.2721 119.6013 141.2791 169.5226 178.5942 216.0125 224.6491 225.6912 251.3842 277.7961 307.6469 318.7110 328.1029 370.7349 398.7210 421.5748 453.4978 467.9654 473.7495 484.8296 497.1822 520.0109 537.6021 542.2993 565.6190 567.8815 594.1511 610.0614 637.8601 642.6792 682.7986 702.6392 724.6623 746.7629 759.1732 797.3191 798.9281 801.3870 814.5030 831.1223 841.5750 859.7804 879.5322 885.8617 897.4970 927.7654 937.9639 948.7126 951.0010 969.6495 970.2505 987.7872 988.5902 1027.5984 1051.9794 1076.3696 1081.7979 1131.7067 1137.4560 1150.0134 1166.8210 1176.0715 1190.8179 1210.2240 1215.7250 1239.4150 1240.6276 1247.9398 1255.3767 1270.6581 1286.1597 1341.3112 1358.5536 1373.8542 1377.3058 1396.8723 1399.2444 1422.3794 1424.5086 1434.4411 1452.6682 1463.8655 1486.3665 1496.4893 1519.5534 1555.0167 1591.5254 1592.6056 1603.4208 1618.6764 1628.4348 2967.1234 3086.9456 3101.3128 3119.6463 3126.8958 3129.7425 3134.3240 3143.9039 3147.6485 3159.9249 3163.7113 3166.1676 3172.1961 3553.0211 3583.9044
redmass: 6.2051 5.7743 5.5934 5.4217 6.0335 5.2564 5.8568 3.4573 5.2642 4.2127 3.4194 3.1105 1.4989 2.0896 1.9408 4.2241 5.4642 3.7914 3.4086 5.1491 4.0717 4.5831 3.2385 4.9410 6.6268 5.4730 4.8640 6.1522 5.4837 3.8032 3.9449 5.3517 6.0956 6.1151 3.2693 5.7048 3.4291 6.2233 1.9029 1.3055 2.8526 3.4366 2.0905 1.6257 4.7237 2.6845 5.5570 3.7888 1.4339 1.6620 4.0998 1.4403 2.1655 1.4342 1.3502 1.3966 1.4112 2.2544 2.8429 3.2157 2.0554 2.0011 1.9367 1.3873 1.3241 1.2569 1.2877 1.4712 2.0920 2.0991 1.7113 1.7698 2.5316 1.9144 2.3127 1.2209 5.4683 3.9399 1.2665 1.8198 2.7294 2.4616 5.9666 3.1668 3.1711 2.8161 2.7242 1.1111 4.0712 4.4714 6.6632 6.3615 7.1992 6.0302 7.1496 6.8099 1.0696 1.0941 1.0880 1.0886 1.0870 1.0902 1.0898 1.0880 1.0927 1.0981 1.0992 1.0974 1.0965 1.0663 1.0656
irintensity: 0.9411 0.1031 0.0347 2.5592 6.1373 1.2370 1.7893 3.2407 8.3757 5.2313 9.7813 15.9849 66.4522 35.1702 59.1026 15.9432 4.5292 28.1370 4.4730 3.5482 1.4869 4.5052 1.0627 1.5046 3.2858 0.7058 7.5317 1.4850 10.9189 5.2964 3.8096 2.4264 8.6075 10.4469 0.7952 32.8403 2.9427 2.0676 29.5457 25.0362 41.5242 17.3467 37.2365 42.7449 2.3830 48.8907 3.6641 29.0769 3.4404 5.9819 90.8889 0.5784 10.2706 2.8673 0.3142 1.8997 0.5569 11.2851 7.6486 79.6631 14.2310 20.9878 41.3296 4.2734 114.6877 93.7175 4.1094 11.8775 268.1889 49.8530 51.7546 6.6370 169.2697 16.2862 87.2297 21.9397 13.3554 32.5049 42.6336 104.9284 8.9620 10.9956 5.0458 9.5462 71.3887 118.8002 85.4742 5.3296 43.7532 27.5240 100.8897 6.3304 22.3068 13.4002 8.5979 22.0656 62.8192 24.0754 11.7707 16.9644 1.0439 13.1914 12.3055 7.6896 28.1237 26.6906 46.5161 8.2900 3.7374 6.0902 28.1575
temp: 298.150 k
press: 1.00000 atm
elementType: 8 8 8 7 6 6 6 6 6 6 6 6 6 6 6 6 6 6 6 6 6 6 6 6 1 1 1 1 1 1 1 1 1 1 1 1 1 1 1
symmnumber: 1
zpe: 777880.8 jmol-1
zpe.correction: 0.296279 hartree
zpe.thermalcorrener: 0.316018 hartree
zpe.thermalcorrenthalpy: 0.316962 hartree
zpe.thermalcorrgfe: 0.246874 hartree
zpe.sumelectzpe: -1049.877697 hartree
zpe.sumelectthermal: -1049.857959 hartree
zpe.sumelectthermalent: -1049.857015 hartree
zpe.sumelectthermalfe: -1049.927103 hartree
dipole: 1.0149 3.9207 0.8748
dipole: 4.1433
quadrupole: -126.0273 -132.1360 -135.1220
quadrupole: -10.0082 -0.6976 -4.2628
quadrupole: 5.0678 -1.0409 -4.0269 -10.0082 -0.6976 -4.2628
hfenergy: -1050.1739766 hartree
pointgroup: C01 [X(C20H15N1O3)]
dipole: -0.3361591 -1.4580072 0.6468892 debye
polarizability: 389.5664037|-4.1838455|209.6765208|34.3201642|-17.7707548|164.3066972 unknown
InChI: InChI=1S/C20H15NO3/c22-12-14-5-1-7-16-15(14)9-10-18(20(16)23)24-17-8-2-4-13-6-3-11-21-19(13)17/h1-11,22-23H,12H2
charge 0 multiplicity 1
39 atoms
O  -1.052082 0.943655 -0.277271
O  0.232348 -1.476319 -0.846482
O  5.553663 2.750231 -0.036516
N  -3.567326 1.119305 -1.320862
C  3.141638 0.621092 0.406549
C  2.42061 -0.529893 -0.104625
C  4.57565 0.532996 0.573257
C  0.997631 -0.4306 -0.317607
C  0.31385 0.750144 0.018043
C  2.406746 1.815081 0.714006
C  3.14056 -1.738359 -0.386664
C  1.025069 1.86938 0.531895
C  5.237553 -0.662179 0.269533
C  5.367645 1.743751 1.034538
C  -2.043063 0.143328 0.317573
C  4.52234 -1.803366 -0.202498
C  -3.367293 0.275945 -0.239683
C  -4.439886 -0.490649 0.367453
C  -1.804922 -0.696148 1.410701
C  -4.172657 -1.346196 1.483502
C  -2.87536 -1.440059 1.989549
C  -5.748627 -0.346485 -0.200537
C  -5.942118 0.504033 -1.289672
C  -4.816255 1.216884 -1.815025
H  2.922297 2.688109 1.126056
H  2.617951 -2.639873 -0.732733
H  0.449954 2.77117 0.761476
H  6.324895 -0.720791 0.392536
H  4.896186 2.216766 1.921011
H  6.393799 1.451632 1.306966
H  5.061577 -2.732029 -0.4160
H  -0.7952 -0.784418 1.822489
H  -4.993204 -1.9191 1.930459
H  -2.66314 -2.090693 2.844835
H  -6.583669 -0.910024 0.232071
H  0.80066 -2.163907 -1.273061
H  -6.929044 0.634684 -1.744632
H  -4.942829 1.891068 -2.671011
H  4.677855 2.925534 -0.467819
