program: Gaussian 09
title: 000119557
version: EM64L-G09RevD.01
frameworkgroup: C1[X(C4H7N3O3)]
method: RPBEPBE
basis: SDD
operation: Freq
keyword: #pfreq=noraman
keyword: PBEPBE/SDD
title: #p freq=noraman PBEPBE/SDD
converged: YES YES NO NO
title: Mulliken charges:
elementType: O O O N N N C C C C H H H H H H H
charge: -0.189278 -0.254294 -0.228800 -0.145536 0.037243 -0.619559 -0.466162 0.250932 -0.759944 0.321204 0.285315 0.286714 0.265034 0.251019 0.252694 0.362614 0.350804
chargesum: 0.00000
title: Mulliken charges with hydrogens summed into heavy atoms:
elementType: O O O N N N C C C C
charge: -0.189278 -0.254294 -0.228800 -0.145536 0.037243 0.093858 0.105867 0.250932 0.008803 0.321204
polarizability: 9.29319765e+01 -2.11155923e+00 8.13201628e+01 7.92465054e+00 4.35698314e+00 5.47162702e+01
1716.lowfreq: -10.2058 -6.1580 -0.0010 -0.0008 -0.0006 5.4119 34.3505 48.9433 80.1355
frequency: 34.3039 48.9357 80.1321 117.0185 155.3516 232.8660 245.8247 294.5543 346.4014 384.7598 441.6309 459.9124 505.8720 543.6772 565.6999 631.1750 645.4535 711.5915 765.3137 813.7408 850.8131 952.1767 982.6889 1052.4536 1094.9138 1172.0629 1204.9205 1278.9263 1312.6406 1352.5105 1367.7172 1373.6487 1407.9301 1443.7249 1455.2401 1566.7325 1649.1164 1683.8650 2985.3512 3021.4166 3071.1036 3095.4587 3127.4988 3510.8326 3681.2061
redmass: 4.3653 6.1013 6.0500 5.6085 1.0378 8.1041 5.8459 2.7584 4.5674 4.8911 2.4642 10.3394 3.3176 2.0145 1.5426 4.5224 1.1168 9.2767 4.0033 2.0734 5.5408 2.0204 1.8286 2.2294 2.5970 4.3585 3.7461 1.3613 1.3103 5.4131 2.3957 1.5425 1.1941 1.0714 1.0523 1.2220 8.8364 7.8035 1.0374 1.0576 1.0964 1.1028 1.1000 1.0468 1.1035
irintensity: 0.7425 3.4950 6.4555 5.5210 0.4890 13.6172 7.7926 6.8703 14.7006 3.5839 5.1186 4.0023 26.0434 65.2923 54.0873 31.2742 168.8493 40.6257 15.1554 54.3148 58.7345 77.2749 3.8465 4.1753 12.6939 56.2850 113.2237 51.3924 17.5266 237.8879 52.3371 113.2230 40.3503 25.2609 24.5818 169.2944 181.7011 284.1220 1.1176 8.5309 5.4646 5.7606 9.6205 53.4523 82.3943
temp: 298.150 k
press: 1.00000 atm
elementType: 8 8 8 7 7 7 6 6 6 6 1 1 1 1 1 1 1
symmnumber: 1
zpe: 321312.0 jmol-1
zpe.correction: 0.122381 hartree
zpe.thermalcorrener: 0.133137 hartree
zpe.thermalcorrenthalpy: 0.134081 hartree
zpe.thermalcorrgfe: 0.084886 hartree
zpe.sumelectzpe: -545.730348 hartree
zpe.sumelectthermal: -545.719592 hartree
zpe.sumelectthermalent: -545.718648 hartree
zpe.sumelectthermalfe: -545.767843 hartree
dipole: 4.1730 0.0698 1.8781
dipole: 4.5767
quadrupole: -58.8530 -68.8231 -54.3713
quadrupole: 4.7848 0.1014 -1.6934
quadrupole: 1.8295 -8.1406 6.3112 4.7848 0.1014 -1.6934
hfenergy: -545.8527293 hartree
pointgroup: C01 [X(C4H7N3O3)]
dipole: -1.6447477 -0.1889562 -0.7080278 debye
dipolederiv: -1.0051636 0.0830923 -0.1320522 -0.0323989 -0.2801214 -0.0545464 -0.1362846 -0.0340327 -0.5549052 -0.6524857 -0.0572068 -0.0529098 0.0305222 -1.0104219 0.2026336 -0.1036725 0.1388092 -0.4247904 -0.3070466 -0.7250159 0.0670047 0.0005604 -0.8614396 0.0915451 0.0168098 -0.1061188 -0.1859089 -0.4472646 -0.2011356 -0.0567273 -0.5814245 -1.165929 0.0722351 0.1456394 0.1605653 -0.1904885 -0.1501001 0.4173392 -0.0324816 0.2008264 1.3851982 -0.2223924 -0.1630865 -0.1997365 -0.0081796 -1.1581002 0.1641736 -0.1573907 0.2084531 -0.3996085 0.0182893 -0.2190998 -0.0022345 -0.7406055 -0.1584572 0.088986 0.1533096 -0.13419 0.0339033 0.0219599 0.3291714 -0.0222996 -0.0346341 1.3165475 -0.1219145 -0.0338 -0.0234989 0.1249964 0.163359 -0.1806417 0.2329347 0.9671367 -0.0843809 -0.0100968 -0.1088014 0.0085346 0.0154016 -0.0457807 -0.039933 -0.0914408 -0.4969852 1.7640131 0.3777848 0.33628 0.2084031 1.5052221 -0.2599168 0.4368885 -0.1382348 0.5068193 0.0196656 0.0212676 -0.0166887 0.0251799 0.039999 -0.0970247 -0.0338985 -0.0126535 0.0520885 0.1403572 -0.0067884 0.034827 0.0745613 0.0748934 0.0366982 0.0086984 0.0135537 0.1455487 -0.0399694 0.0443945 0.0977928 0.0264958 0.1195466 -0.0403123 0.0579553 -0.0299288 0.0498736 0.0371498 -0.1111388 0.0055877 -0.1001864 0.0268117 -0.0275241 -0.0020956 0.0298871 0.0888623 0.0949579 0.0730482 -0.0320693 0.0673061 -0.0253255 0.0543197 -0.0406763 -0.011083 0.0981523 0.3503983 -0.0159106 -0.029808 0.0207271 0.2278651 0.038066 -0.0293815 0.0321525 0.358481 0.2798788 -0.0208787 -0.042073 0.0001287 0.1890086 0.0483915 -0.0463928 0.0398605 0.3695349 unknown
polarizability: 92.5467277|3.662856|81.5331742|7.6707008|-4.7885073|54.8885077 unknown
InChI: InChI=1S/C4H7N3O3/c1-3(8)2-7(6-10)4(5)9/h2,5H2,1H3
charge 0 multiplicity 1
17 atoms
O  3.047723 -0.072382 0.3969
O  -1.464853 -1.929065 0.474918
O  0.093765 2.368764 -0.026887
N  -0.599801 0.25104 0.282527
N  -0.877301 1.54947 -0.164352
N  -2.806153 -0.236206 -0.438214
C  0.68367 -0.11491 0.895761
C  1.892054 -0.187896 -0.074994
C  1.611678 -0.455927 -1.541462
C  -1.659542 -0.737359 0.118656
H  0.936605 0.601977 1.695083
H  0.540759 -1.119641 1.334148
H  2.551766 -0.691914 -2.062499
H  0.893626 -1.287904 -1.662456
H  1.162541 0.44136 -2.008693
H  -2.866516 0.750834 -0.692253
H  -3.58702 -0.87274 -0.578283
