program: Gaussian 09
title: 000119570
version: EM64L-G09RevD.01
frameworkgroup: C1[X(C10H17N3S)]
method: RPBEPBE
basis: SDD
operation: Freq
keyword: #p
keyword: freq=noraman
keyword: PBEPBE/SDD
title: #p freq=noraman PBEPBE/SDD
converged: YES YES NO NO
title: Mulliken charges:
elementType: S N N N C C C C C C C C C C H H H H H H H H H H H H H H H H H
charge: 0.188006 -0.331487 -0.056998 -0.575476 -0.033241 -0.470288 -0.455953 -0.475884 -0.385435 0.319491 -0.324864 -0.387985 -0.186872 -0.681285 0.205271 0.232952 0.189269 0.223701 0.241955 0.231214 0.222112 0.238662 0.207697 0.169865 0.182933 0.219638 0.208426 0.210313 0.219494 0.330573 0.324193
chargesum: 0.00000
title: Mulliken charges with hydrogens summed into heavy atoms:
elementType: S N N N C C C C C C C C C C
charge: 0.188006 -0.092825 -0.056998 0.079289 0.172030 -0.048067 0.009703 -0.022557 -0.385435 0.319491 0.052698 0.014587 -0.186872 -0.043051
polarizability: 1.99782321e+02 3.48513681e+00 1.42604235e+02 -5.64292697e+00 4.40817129e+00 9.06289646e+01
1716.lowfreq: -2.7155 -0.0018 -0.0005 0.0023 6.2915 7.3015 37.5354 49.3798 68.6736
frequency: 37.5115 49.3582 68.6442 93.4445 119.9141 145.5681 186.4805 204.6046 220.7885 231.7571 249.0575 261.8144 288.0429 309.3227 361.8610 394.1063 404.4433 446.4526 462.7393 495.1393 542.3129 560.0627 574.4454 590.2767 619.4188 654.1631 742.5087 758.8776 821.5457 844.0153 887.5775 902.8575 910.8358 960.5964 980.3128 1029.7235 1036.8709 1064.6876 1076.9249 1096.8561 1127.8337 1130.1971 1149.9853 1156.4314 1176.1992 1210.9144 1225.4908 1237.0879 1246.2888 1280.4444 1283.0381 1286.9216 1296.1646 1308.1373 1332.9768 1353.9421 1369.1288 1378.2579 1391.1571 1455.7615 1460.0070 1463.5819 1471.1599 1474.3215 1477.6503 1483.6707 1497.8416 1569.7482 1589.7153 1628.0110 2836.3327 2843.8750 2965.7787 2969.0147 2973.4114 2975.8994 2981.2299 3003.1756 3024.1439 3032.7543 3034.8231 3047.7805 3072.1847 3076.6347 3414.3375 3562.0191 3714.7340
redmass: 4.1892 2.6791 1.8580 3.6490 2.6153 3.0679 3.3752 2.0230 1.6184 2.6431 2.8797 1.5778 3.2350 1.9493 4.4554 1.2971 2.7822 4.1117 2.3487 4.8462 3.6489 4.6116 4.6514 5.1911 5.6011 1.5897 3.4278 1.0880 2.1281 2.6415 1.2422 1.6253 1.4721 2.7139 3.1794 2.3945 2.3888 2.3006 2.1349 2.1025 1.3219 1.5757 2.7064 2.3347 2.7842 1.4200 1.3830 1.3461 2.0876 1.3810 1.5393 1.3566 1.4929 1.3707 1.3892 1.7633 2.2967 1.6075 1.2168 1.1678 1.1934 1.0836 1.0999 1.0586 1.0434 1.0687 1.0882 2.6228 3.1541 2.2760 1.0803 1.0722 1.0648 1.0598 1.0624 1.0362 1.0638 1.0843 1.0995 1.0965 1.0981 1.1005 1.1007 1.0992 1.0739 1.0449 1.1046
irintensity: 0.3964 0.7990 0.1736 0.6135 1.3399 2.9871 8.5164 1.8254 1.3806 0.6584 8.0169 68.0057 6.7835 50.9855 1.3515 209.3802 16.6152 3.0074 3.6988 0.6260 0.7247 7.4999 31.4266 8.8358 3.6828 81.2793 12.4136 5.3916 0.1543 12.2799 2.3937 1.5452 3.2452 9.1371 9.5235 6.5110 2.2514 3.0881 1.6111 15.3025 10.7021 8.3808 13.4137 34.5549 3.9320 2.3184 17.3401 2.1067 85.8403 11.4795 30.9282 3.9309 9.0857 1.5447 13.2325 7.6798 20.9218 15.0342 10.4134 4.6149 10.2237 11.6169 5.3378 4.6965 13.3840 5.2461 10.6912 88.8405 10.7429 419.6396 35.2250 142.6286 30.9321 25.1907 38.2916 34.7306 55.8088 29.8829 28.3629 19.0395 15.4373 51.2274 75.8448 51.8944 3.2293 108.9998 44.1479
temp: 298.150 k
press: 1.00000 atm
elementType: 16 7 7 7 6 6 6 6 6 6 6 6 6 6 1 1 1 1 1 1 1 1 1 1 1 1 1 1 1 1 1
symmnumber: 1
zpe: 686214.6 jmol-1
zpe.correction: 0.261365 hartree
zpe.thermalcorrener: 0.276518 hartree
zpe.thermalcorrenthalpy: 0.277462 hartree
zpe.thermalcorrgfe: 0.218713 hartree
zpe.sumelectzpe: -952.482263 hartree
zpe.sumelectthermal: -952.467111 hartree
zpe.sumelectthermalent: -952.466166 hartree
zpe.sumelectthermalfe: -952.524915 hartree
dipole: -0.2224 -0.5156 0.8459
dipole: 1.0153
quadrupole: -71.4572 -89.3159 -96.6778
quadrupole: 8.5358 1.5306 0.5511
quadrupole: 14.3598 -3.4989 -10.8608 8.5358 1.5306 0.5511
hfenergy: -952.7436286 hartree
pointgroup: C01 [X(C10H17N3S1)]
dipole: 0.0846404 -0.2205655 -0.3221033 debye
polarizability: 199.6172234|-5.4422925|142.3764406|-4.3614478|-6.6726256|91.0218572 unknown
InChI: InChI=1S/C10H17N3S/c1-2-5-12-7-3-4-8-9(6-7)14-10(11)13-8/h7,12H,2-6,11H2,1H3
charge 0 multiplicity 1
31 atoms
S  2.377516 -1.885312 0.339482
N  -2.434499 0.622005 0.277268
N  3.257248 0.589465 -0.242854
N  5.01679 -1.03412 -0.119985
C  -1.026636 0.594536 -0.181988
C  -0.31149 1.888337 0.277624
C  -0.296042 -0.656253 0.392981
C  1.131135 1.983987 -0.273128
C  1.188858 -0.500268 0.204433
C  1.857584 0.67069 -0.096245
C  -3.323134 -0.425972 -0.273193
C  -4.780036 -0.205054 0.179121
C  3.696748 -0.642374 -0.052204
C  -5.742734 -1.275926 -0.376338
H  -0.954035 0.538646 -1.2999
H  -0.298393 1.901975 1.384503
H  -0.893564 2.772221 -0.053394
H  -0.661194 -1.571788 -0.110638
H  -0.567254 -0.745694 1.464493
H  1.690886 2.783742 0.246611
H  1.121258 2.258152 -1.347495
H  -2.84373 1.556877 0.132352
H  -2.981812 -1.413777 0.093183
H  -3.287811 -0.470626 -1.392974
H  -5.116731 0.800401 -0.151206
H  -4.8081 -0.199645 1.285394
H  -5.742151 -1.27973 -1.48266
H  -5.450966 -2.287382 -0.03644
H  -6.779326 -1.094156 -0.03962
H  5.715341 -0.325053 -0.32966
H  5.300674 -1.995504 0.036778
