program: Gaussian 09
title: 000119567
version: EM64L-G09RevD.01
frameworkgroup: C1[X(C8H11N3O4)]
method: RPBEPBE
basis: SDD
operation: Freq
keyword: #p
keyword: freq=noraman
keyword: PBEPBE/SDD
title: #p freq=noraman PBEPBE/SDD
converged: YES YES NO NO
title: Mulliken charges:
elementType: O O O O N N N C C C C C C C C H H H H H H H H H H H
charge: -0.234679 -0.157577 -0.245833 -0.432909 -0.147830 -0.025950 0.078808 -0.308785 0.192681 -0.110652 -0.333573 -0.284674 -0.162405 -0.165017 -0.387719 0.260203 0.239343 0.279995 0.214361 0.231763 0.268808 0.245155 0.224030 0.225716 0.199874 0.336867
chargesum: 0.00000
title: Mulliken charges with hydrogens summed into heavy atoms:
elementType: O O O O N N N C C C C C C C C
charge: -0.234679 -0.157577 -0.245833 -0.096042 -0.147830 -0.025950 0.078808 0.190761 0.192681 0.169343 0.112551 -0.015866 0.082750 0.059013 0.037872
polarizability: 1.43773500e+02 -3.76082444e+00 1.31939560e+02 -1.12601917e+01 -2.27459575e+00 1.09024185e+02
1716.lowfreq: -5.9823 0.0007 0.0009 0.0009 3.8231 6.4598 20.0523 21.6371 32.6457
frequency: 20.0334 21.5591 32.5987 49.7219 64.0298 114.9406 119.3081 152.8884 186.8950 202.6199 225.2790 258.5397 270.1812 327.9645 381.4276 401.7846 424.6626 459.8846 525.4028 561.3601 609.9694 629.0439 695.7937 706.9279 761.6407 782.6533 796.7419 865.6446 869.0703 883.9906 919.0310 927.8088 977.9561 995.8634 1018.7678 1023.7233 1066.5762 1077.1074 1106.7160 1112.9267 1139.9289 1165.4764 1205.8013 1210.5203 1227.5837 1278.5520 1284.8948 1286.7866 1320.7806 1333.2022 1356.6863 1362.0166 1363.4175 1373.2485 1382.7812 1420.9186 1448.9247 1461.8567 1467.3548 1469.7434 1692.6886 2950.3250 2960.0983 3022.5327 3045.4377 3071.4855 3092.7412 3117.0785 3119.8657 3232.1472 3256.9673 3558.1176
redmass: 8.1324 6.2735 4.7990 5.4296 4.7044 2.8143 3.2629 4.7749 2.8504 5.3005 2.3838 2.1419 3.6229 4.2327 2.2147 5.2868 9.0911 2.9505 2.8474 4.8828 5.9225 4.7752 10.3046 5.6259 9.1173 1.3430 2.3086 2.3551 1.5766 6.5031 1.9785 3.2397 1.7224 1.2490 3.5596 2.9278 1.6563 1.9228 2.6210 2.7359 4.0824 1.2727 2.6448 1.3701 1.7063 1.9132 1.3476 1.4402 1.2870 3.1628 3.7631 3.6118 1.6191 1.4266 1.3801 1.7922 1.7121 1.0892 1.2723 1.5338 6.4405 1.0690 1.0561 1.1061 1.0561 1.0903 1.0952 1.0903 1.1110 1.0925 1.1085 1.0665
irintensity: 3.9013 0.4983 4.6797 2.9217 4.8490 1.9801 1.4141 3.9031 0.7531 8.0161 60.2877 115.0053 30.7152 7.8242 1.3202 1.5282 0.7608 12.3993 4.2528 1.2893 28.2609 3.1035 15.6780 36.7699 23.5383 58.0930 12.9497 4.2208 2.2446 6.4642 57.9695 49.2457 55.4751 57.3033 101.4575 125.1919 21.6564 12.8473 37.0899 16.3625 106.0980 38.2039 69.5752 6.7740 17.4817 76.4387 22.0298 36.4620 3.5218 140.0827 38.6771 183.7386 4.7253 21.0498 21.2523 1.0116 12.5629 7.0733 18.4804 10.8182 0.6994 69.3187 23.7143 25.0113 32.9458 3.5408 27.7583 22.3019 2.5168 3.2625 0.5373 10.4522
temp: 298.150 k
press: 1.00000 atm
elementType: 8 8 8 8 7 7 7 6 6 6 6 6 6 6 6 1 1 1 1 1 1 1 1 1 1 1
symmnumber: 1
zpe: 510261.1 jmol-1
zpe.correction: 0.194348 hartree
zpe.thermalcorrener: 0.209600 hartree
zpe.thermalcorrenthalpy: 0.210545 hartree
zpe.thermalcorrgfe: 0.148095 hartree
zpe.sumelectzpe: -775.298337 hartree
zpe.sumelectthermal: -775.283084 hartree
zpe.sumelectthermalent: -775.282140 hartree
zpe.sumelectthermalfe: -775.344590 hartree
dipole: -1.7542 2.1884 1.5759
dipole: 3.2171
quadrupole: -110.2363 -88.3701 -82.2193
quadrupole: 19.3208 16.5054 -2.5025
quadrupole: -16.6278 5.2385 11.3893 19.3208 16.5054 -2.5025
hfenergy: -775.4926848 hartree
pointgroup: C01 [X(C8H11N3O4)]
dipole: 0.5150867 1.0346531 0.5159513 debye
dipolederiv: -1.21691 0.1000614 -0.0023779 0.3694113 -0.5025539 0.1299606 -0.0532846 0.0766552 -0.3775126 -0.4695651 -0.2946446 -0.053495 -0.3542497 -0.6868374 -0.2478462 -0.007866 -0.1723731 -0.3819094 -0.62094 -0.1015562 0.2794289 -0.2019747 -0.4158917 0.0005378 0.2657407 -0.0788291 -0.7086023 -0.7759572 0.1894241 -0.1834964 0.0985828 -0.1825607 -0.1210135 -0.2874536 -0.1048676 -0.7497791 -0.6896653 -0.1601687 0.277424 -0.3424768 -0.1116207 0.3391736 0.5070879 0.4508396 -0.2623577 -0.3503233 -0.1786866 -0.0589818 -0.0964478 -0.1548642 0.1451256 0.2269443 0.3586917 0.0490773 0.8308056 0.383098 -0.2752395 0.5156642 1.1124944 0.6022642 -0.3068595 0.6046624 1.3229979 1.4041085 0.0829198 -0.0896406 0.2797812 0.4504866 -0.1498072 -0.174341 -0.2895053 0.4692351 0.2902737 0.2322054 0.0264621 0.2882534 -0.0131801 -0.4736213 -0.0351133 -0.5652837 -0.5044715 0.0753863 0.2764141 0.1069986 0.0074554 0.0301297 0.1103959 -0.2957209 -0.3440079 -0.1744546 0.7262417 -0.2011085 0.0821376 -0.4811579 0.4252463 -0.0253905 -0.1362958 0.0149881 0.3155552 -0.0929139 -0.1284026 -0.331424 -0.0242585 -0.3320982 -0.321701 -0.1399275 0.0231562 0.1187239 -0.0680388 0.0959088 -0.0206562 0.1409083 -0.0221391 -0.1481574 -0.0454694 -0.1216293 -0.0976246 -0.0876899 0.0865142 -0.0101445 0.0788265 -0.02926 -0.1699744 0.1091441 -0.1917019 -0.1393363 0.528513 -0.1155173 0.1239799 -0.0148493 0.2769567 0.0908756 0.0959951 0.093353 0.6368575 -0.0009323 0.0094496 -0.012994 -0.0043235 0.1426428 -0.0969962 -0.0178877 0.0272456 -0.0196272 -0.0817135 0.0536895 0.0075713 0.0347131 -0.0836106 0.0492371 0.0262561 -0.0481717 0.0908288 0.1580122 -0.0843463 0.005453 -0.0635721 0.0776946 -0.0315649 0.012592 -0.0068828 0.1300378 -0.0032488 -0.0326802 0.0337981 -0.0035565 -0.0954056 0.0611954 0.0932874 0.0993426 -0.0194332 -0.0330157 0.0337558 -0.10745 0.1163752 0.0244267 0.0025384 -0.0421657 -0.062933 -0.0913275 0.1341495 -0.0117766 0.0739075 -0.0314192 0.12373 -0.0166753 0.061312 -0.037191 0.0247144 0.011023 -0.0734281 0.0206034 -0.1277035 0.0268619 0.0797099 -0.0170479 0.0965145 0.0743327 -0.0075292 -0.0814203 0.0220207 -0.0733352 -0.003486 0.1201447 0.0561339 0.1057817 0.0822977 0.0555037 -0.033473 0.0064472 -0.094523 -0.0283712 0.0931651 0.0417328 0.0677667 -0.0165313 -0.087388 0.1060901 -0.0078457 0.1340878 -0.1096199 -0.1153977 -0.0356267 -0.0496701 -0.0357767 0.3718137 -0.1523217 0.0875133 -0.1502115 0.0808294 0.0938219 0.0988333 0.0540492 0.2640856 unknown
polarizability: 142.2114946|12.3342901|115.4887887|-0.8032611|11.2169441|127.0369617 unknown
InChI: InChI=1S/C8H11N3O4/c12-5-1-2-6-15-7-10-4-3-9-8(10)11(13)14/h1-4,12H,5-7H2
charge 0 multiplicity 1
26 atoms
O  0.730025 1.659361 -0.675322
O  -2.928627 -2.136157 -1.708254
O  -1.26416 -0.797923 -2.526301
O  5.365941 0.31592 1.920474
N  -1.568084 0.944519 -0.280566
N  -2.991722 -0.600018 0.630939
N  -2.149393 -1.121726 -1.620581
C  -0.623397 1.701076 -1.165093
C  -2.241417 -0.280027 -0.443166
C  -1.926785 1.399087 0.986689
C  1.429762 0.361124 -0.912324
C  -2.79737 0.440605 1.530446
C  2.88607 0.579733 -0.614518
C  3.611232 -0.191287 0.235018
C  5.087358 -0.01532 0.505648
H  -0.724871 1.290906 -2.182348
H  -0.913209 2.76255 -1.122477
H  -1.530384 2.329367 1.386124
H  0.999744 -0.423787 -0.258762
H  1.26641 0.065613 -1.969543
H  -3.284909 0.443221 2.501848
H  3.363673 1.409974 -1.152898
H  3.112474 -1.011485 0.777262
H  5.490557 0.838299 -0.062219
H  5.648389 -0.929554 0.21304
H  5.066894 -0.43547 2.493682
