program: Gaussian 09
title: 000119412
version: EM64L-G09RevD.01
frameworkgroup: C1[X(C5H6O4)]
method: RPBEPBE
basis: SDD
operation: Freq
keyword: #p
keyword: freq=noraman
keyword: PBEPBE/SDD
title: #p freq=noraman PBEPBE/SDD
converged: NO NO NO NO
title: Mulliken charges:
elementType: O O O O C C C C C H H H H H H
charge: -0.408561 -0.152683 -0.235891 -0.125812 -0.506030 -0.468077 0.181248 0.185395 -0.125399 0.268117 0.268692 0.276267 0.277303 0.183253 0.382178
chargesum: 0.00000
title: Mulliken charges with hydrogens summed into heavy atoms:
elementType: O O O O C C C C C
charge: -0.026383 -0.152683 -0.235891 -0.125812 0.030778 0.085492 0.181248 0.185395 0.057854
polarizability: 8.39331195e+01 2.73769484e-01 6.69229122e+01 1.08401280e-01 3.43708135e-02 3.70647580e+01
1716.lowfreq: -19.8286 -0.0011 -0.0011 -0.0010 6.0353 8.8898 15.8299 47.1970 82.9736
frequency: -19.8141 47.1304 82.9470 100.1194 123.0896 228.1879 253.1025 345.2965 439.1891 486.4380 499.7755 569.9297 641.0063 709.2220 743.7112 826.7488 891.2137 905.5675 1016.0383 1024.2823 1060.6398 1115.4960 1143.5101 1243.4992 1262.7195 1312.5317 1374.2240 1384.7614 1426.4957 1437.8415 1610.8829 1653.2223 1663.2793 2875.5964 2970.8726 3008.6312 3017.3978 3067.3964 3510.4146
redmass: 6.6730 5.7640 2.7222 7.1928 1.9263 8.7789 8.4479 11.2919 2.3683 4.0498 1.7886 5.5071 1.2850 5.6787 1.5326 5.8760 1.6023 4.0114 5.0797 2.3733 2.2004 2.3465 1.2254 1.4784 1.1124 2.0467 1.2368 1.9107 1.1378 1.0900 10.9302 8.6609 8.0683 1.0866 1.0625 1.0953 1.0622 1.0982 1.0641
irintensity: 10.5019 5.1317 1.4303 7.0666 4.6292 1.9649 3.0925 7.4899 0.0969 28.4407 30.8913 33.1964 133.6953 32.9469 16.2845 10.6289 10.8787 2.9714 28.6966 0.3120 270.8662 9.0892 0.1264 11.3745 0.3187 143.4879 6.2899 11.2486 25.8297 51.3543 118.2077 75.1661 139.9507 98.7424 16.4899 3.6521 5.8154 4.1068 27.9136
temp: 298.150 k
press: 1.00000 atm
elementType: 8 8 8 8 6 6 6 6 6 1 1 1 1 1 1
symmnumber: 1
zpe: 275574.2 jmol-1
zpe.correction: 0.104961 hartree
zpe.thermalcorrener: 0.113844 hartree
zpe.thermalcorrenthalpy: 0.114788 hartree
zpe.thermalcorrgfe: 0.069752 hartree
zpe.sumelectzpe: -494.312632 hartree
zpe.sumelectthermal: -494.303749 hartree
zpe.sumelectthermalent: -494.302804 hartree
zpe.sumelectthermalfe: -494.347841 hartree
dipole: -3.2389 -1.6888 -0.0121
dipole: 3.6528
quadrupole: -61.0048 -59.0745 -48.8654
quadrupole: -8.6975 0.0089 0.0549
quadrupole: -4.6899 -2.7596 7.4495 -8.6975 0.0089 0.0549
hfenergy: -494.4175925 hartree
pointgroup: C01 [X(C5H6O4)]
dipole: -1.2844159 0.644467 0.0146404 debye
dipolederiv: -0.9995702 -0.5480006 0.0037068 -0.4781579 -0.6265379 0.0042575 0.0054546 0.0045346 -0.4289539 -0.593505 -0.0006246 0.0003483 0.1033639 -0.6844347 -0.006583 0.0018294 -0.0061559 -0.2641165 -0.6885523 0.1451682 0.0036012 -0.1190036 -0.9582144 -0.002124 0.0035344 -0.0043782 -0.3100862 -0.7837043 -0.0226786 0.001048 0.0045806 -0.3813282 -0.0019774 0.00192 -0.0018979 -0.2753891 -0.383772 0.1575994 0.0041433 0.3284274 -0.1975121 -0.0060706 0.0073567 -0.0061062 0.1261363 -0.2362688 0.0928154 0.0058725 0.2350564 -0.12108 -0.0060809 0.0118863 -0.0056072 0.1227354 0.9915105 -0.1729428 -0.0039565 -0.29737 0.6239278 0.0072619 -0.0061639 0.0071494 0.1534307 1.5062503 0.1891307 -0.0150355 0.2883989 1.3851301 0.0027211 -0.0179365 0.0044187 0.1923273 0.6624993 -0.0743218 -0.0032725 0.0323372 0.7331336 0.0104943 -0.0016764 0.0106849 0.1324899 0.0829459 0.0042924 -0.0192575 -0.0937024 0.0687988 -0.0802526 -0.0234861 -0.0816573 0.0028196 0.0844666 0.0028568 0.0191415 -0.0950058 0.0620506 0.0825417 0.0194066 0.0840243 0.0104739 0.0754615 0.0067664 -0.0046435 -0.045383 0.0762615 -0.0694825 -0.0046472 -0.0726719 0.0117451 0.0771608 0.0070256 0.0042084 -0.0456639 0.0687223 0.0734636 -0.000413 0.0754626 0.0210787 -0.0213915 0.1089215 0.0022957 0.0332683 -0.2464101 -0.0061037 0.0007969 -0.0062241 0.1073093 0.226469 0.1039917 0.0017998 0.148854 0.1974926 -0.0020654 0.0021382 -0.0015759 0.3979994 unknown
polarizability: 83.9367261|-0.0074903|66.9144854|-0.2214887|0.3482637|37.0695782 unknown
InChI: InChI=1S/C5H6O4/c6-3-4(7)1-2-5(8)9/h3,8H,1-2H2
charge 0 multiplicity 1
15 atoms
O  -3.470399 -0.792507 0.007576
O  1.620692 -1.476712 -0.029723
O  -2.625678 1.371005 0.00645
O  3.839779 0.375692 -0.009105
C  0.083079 0.437886 -0.000502
C  -1.078705 -0.561786 -0.021804
C  1.445446 -0.233756 -0.012241
C  -2.42272 0.135728 -0.000365
C  2.648198 0.746166 0.000718
H  0.017014 1.101344 0.887629
H  0.017725 1.138288 -0.859435
H  -1.029218 -1.210336 -0.916546
H  -1.021899 -1.260112 0.833235
H  2.367352 1.830648 0.019851
H  -4.341966 -0.31005 0.017062
