program: Gaussian 09
title: 000119460
version: EM64L-G09RevD.01
frameworkgroup: C1[X(C8H7BrO)]
method: RPBEPBE
basis: SDD
operation: Freq
keyword: #p
keyword: freq=noraman
keyword: PBEPBE/SDD
title: #p freq=noraman PBEPBE/SDD
converged: YES YES NO NO
title: Mulliken charges:
elementType: Br O C C C C C C C C H H H H H H H
charge: 0.010252 -0.300382 -0.207537 -0.352861 0.464552 -0.358979 -0.394192 -0.181500 -0.181787 -0.210041 0.237823 0.229946 0.231390 0.270482 0.238860 0.251801 0.252173
chargesum: 0.00000
title: Mulliken charges with hydrogens summed into heavy atoms:
elementType: Br O C C C C C C C C
charge: 0.010252 -0.300382 0.030287 0.108475 0.464552 -0.088497 -0.155332 0.070300 0.070385 -0.210041
polarizability: 1.65675004e+02 6.19144124e-01 9.05130338e+01 2.60664852e+00 -1.17189368e+00 4.94092760e+01
1716.lowfreq: -4.4604 -0.0007 -0.0006 -0.0005 6.7027 10.0671 51.6336 84.3458 134.2381
frequency: 51.6122 84.3260 134.2362 204.4578 231.9224 277.9037 382.1317 406.8194 423.9846 527.6182 597.4993 622.8292 715.1794 735.0428 756.5720 817.3065 831.7302 843.0695 949.3236 967.9192 976.2309 995.9255 1018.9746 1058.7348 1093.5667 1104.1302 1113.0904 1182.3477 1187.2455 1241.3979 1292.1378 1345.4328 1383.0549 1401.8704 1471.4766 1476.7979 1580.4218 1601.6283 3060.4620 3092.5264 3128.5182 3147.1467 3170.4865 3171.4131 3173.5427
redmass: 4.9228 4.0069 7.6200 4.5875 9.1703 5.7282 4.1399 2.9128 6.4715 2.8627 4.0223 6.9417 3.7495 5.4945 3.9439 2.5616 1.7434 1.4727 1.3432 1.5453 1.3575 4.4182 1.1759 2.5803 1.4150 1.3050 1.3225 1.2115 2.3332 1.4701 1.3067 3.3642 5.1123 2.1980 1.2196 2.3876 7.3219 6.1442 1.0521 1.0905 1.0900 1.0887 1.0956 1.1195 1.0961
irintensity: 2.2558 3.9487 2.4644 2.8843 0.2908 6.1315 2.7094 0.2822 14.1536 28.4527 2.6938 1.0310 1.2343 2.6792 43.4375 65.9834 3.4895 18.1146 7.7217 28.1928 1.4065 35.8018 2.5519 26.4486 1.6829 2.7050 15.3297 0.7896 2.9616 0.8110 2.5809 10.4802 2.5755 10.6088 13.5510 61.1520 0.7448 11.3927 30.2070 18.5411 11.5631 0.5907 6.7111 31.8939 0.9766
temp: 298.150 k
press: 1.00000 atm
elementType: 35 8 6 6 6 6 6 6 6 6 1 1 1 1 1 1 1
symmnumber: 1
zpe: 329152.8 jmol-1
zpe.correction: 0.125368 hartree
zpe.thermalcorrener: 0.134326 hartree
zpe.thermalcorrenthalpy: 0.135270 hartree
zpe.thermalcorrgfe: 0.089509 hartree
zpe.sumelectzpe: -396.965044 hartree
zpe.sumelectthermal: -396.956086 hartree
zpe.sumelectthermalent: -396.955141 hartree
zpe.sumelectthermalfe: -397.000903 hartree
dipole: 1.3981 1.5399 1.6554
dipole: 2.6583
quadrupole: -69.5801 -60.6278 -70.8358
quadrupole: 5.7936 7.8522 -1.9658
quadrupole: -2.5656 6.3868 -3.8212 5.7936 7.8522 -1.9658
hfenergy: -397.0904118 hartree
pointgroup: C01 [X(C8H7Br1O1)]
dipole: 0.5368922 -0.7491042 -0.4943308 debye
dipolederiv: -0.7655224 0.0845705 -0.0543389 0.0935083 -0.0800133 0.0129686 -0.067717 0.0137989 -0.0459136 -0.5791115 -0.0372038 -0.0763508 -0.172665 -0.4435944 -0.147925 -0.2451546 -0.1418482 -0.3986911 0.4088309 -0.0338962 0.0395038 -0.0349358 0.2581623 -0.0675882 0.3218198 -0.0022503 0.213306 0.1854586 -0.0983521 0.0604278 -0.0076924 0.1715334 0.0701578 -0.0194377 0.0010917 0.2475521 0.2077494 0.017151 -0.0433218 -0.0305518 -0.0965424 0.0308041 -0.0832498 0.027227 -0.0542008 -0.0534283 0.0501335 0.0133845 0.0057996 0.020207 -0.0392247 0.0609849 -0.0053647 -0.1267083 -0.0548621 -0.0650325 0.0358645 0.0298915 0.0711841 -0.0405695 -0.0121935 -0.0489864 -0.139854 -0.390312 -0.058804 -0.006473 0.002472 0.0496382 -0.0183658 -0.0243228 -0.0260822 -0.0893108 -0.3459899 0.1569393 -0.0418986 0.1144165 -0.0104973 -0.0109726 -0.0280266 -0.0029482 -0.0917715 1.2983053 -0.1610574 0.1241762 -0.1716726 0.0431119 -0.0442537 0.1327478 -0.0470403 -0.1136546 -0.0198972 -0.0080255 -0.0078042 0.0426343 -0.0650221 0.095706 -0.0456412 0.0946452 0.0487223 -0.1393584 0.1024281 0.0570706 0.0775414 0.0579236 -0.0385562 0.0652742 -0.0157974 0.0314593 0.07346 0.0690935 -0.0683343 0.0604439 0.0527631 0.0654353 -0.0196909 0.0353018 -0.0806815 0.0498358 -0.077754 0.004976 -0.0581468 0.0289302 0.0277065 0.0067889 0.0129057 0.1464978 0.0291261 0.0857071 -0.0299031 0.0697812 -0.0521946 0.0452936 -0.0259683 0.048168 0.1432283 0.0683476 0.0560934 -0.0155819 0.0565717 -0.0209683 0.0350725 -0.0220755 0.033591 0.1525887 0.0273681 -0.0819909 0.0086032 -0.077396 0.0153785 0.0243112 0.0058622 0.0235884 0.1574317 unknown
polarizability: 165.447126|-4.3116823|88.6562529|1.8562371|-9.2416184|51.4939353 unknown
InChI: InChI=1S/C8H7BrO/c9-7-3-1-6(2-4-7)8-5-10-8/h1-4,8H,5H2
charge 0 multiplicity 1
17 atoms
Br -4.039155 0.329834 -0.240543
O  3.010401 0.68266 0.577192
C  2.153983 -0.540224 0.32713
C  3.11869 -0.061048 -0.726455
C  0.680531 -0.317424 0.209793
C  0.155014 0.970396 -0.064362
C  -0.21263 -1.40652 0.366188
C  -1.235796 1.168158 -0.198237
C  -1.607216 -1.226422 0.230717
C  -2.101007 0.062866 -0.05444
H  2.458648 -1.411582 0.922642
H  4.064696 -0.595498 -0.878343
H  2.719637 0.473917 -1.597649
H  0.842009 1.820353 -0.139234
H  0.175602 -2.406766 0.593117
H  -1.637982 2.164492 -0.402259
H  -2.291223 -2.071292 0.350043
