program: Gaussian 09
title: 000119554
version: EM64L-G09RevD.01
frameworkgroup: C1[X(C20H13NO4)]
method: RPBEPBE
basis: SDD
operation: Freq
keyword: #p
keyword: freq=noraman
keyword: PBEPBE/SDD
title: #p freq=noraman PBEPBE/SDD
converged: YES YES NO NO
title: Mulliken charges:
elementType: O O O O N C C C C C C C C C C C C C C C C C C C C H H H H H H H H H H H H H
charge: -0.420737 -0.412927 -0.214557 -0.223042 0.013820 0.220682 0.006578 0.313454 -0.312626 0.058025 0.440587 0.501529 -0.239916 0.305421 -0.781138 0.493483 -0.419189 -0.377375 -0.457915 -0.184136 -0.491796 -0.489758 0.209409 -0.470286 -0.446384 0.206912 0.193075 0.248617 0.246835 0.238148 0.304150 0.231764 0.249604 0.248994 0.250984 0.287684 0.335096 0.336933
chargesum: 0.00000
title: Mulliken charges with hydrogens summed into heavy atoms:
elementType: O O O O N C C C C C C C C C C C C C C C C C C C C
charge: -0.085641 -0.075994 -0.214557 -0.223042 0.013820 0.220682 0.006578 0.313454 -0.105714 0.058025 0.440587 0.501529 -0.046840 0.305421 -0.532520 0.493483 -0.172355 -0.139227 -0.153765 0.047627 -0.242192 -0.240764 0.209409 -0.219302 -0.158700
polarizability: 4.74213992e+02 -7.48668062e+00 2.85250220e+02 5.72953787e+00 -1.61126817e+00 1.06211660e+02
1716.lowfreq: -5.4663 -2.3853 -0.0005 -0.0004 -0.0002 6.5490 26.0561 37.8029 45.7848
frequency: 26.0479 37.7910 45.7590 66.1237 83.0175 126.0692 143.1391 172.7069 208.3751 221.3299 235.9838 243.5209 264.5049 268.5651 281.2809 309.2448 333.2620 346.2156 357.7320 390.8669 419.3424 435.0995 484.2159 492.0497 500.2923 516.7480 522.1271 536.7799 549.1582 564.1209 575.5756 586.2836 615.9998 627.4603 668.7266 687.0236 697.7100 713.0546 737.8918 752.8517 791.4715 795.9673 814.0429 821.0919 837.4540 843.4689 862.0882 868.4593 876.3747 904.5309 932.3917 952.1236 970.1747 983.9128 991.7887 997.7397 1000.8632 1009.6267 1022.4474 1054.1873 1115.9072 1129.8212 1157.1269 1159.3287 1169.1710 1173.4669 1183.6223 1190.4232 1198.2064 1206.7592 1229.7887 1254.0859 1286.1655 1289.6335 1292.7972 1321.2644 1335.9586 1344.5659 1362.7975 1388.6585 1393.4122 1410.1059 1412.1692 1422.2651 1433.8826 1446.2793 1470.7892 1487.4987 1499.7087 1556.5579 1578.4920 1606.8460 1607.9104 1629.6348 1664.2074 2919.6580 2935.3236 3120.4513 3123.3839 3127.2910 3144.7089 3151.2875 3160.9835 3164.0282 3188.9707 3212.0899 3515.2966 3524.6618
redmass: 14.4630 6.6228 5.5055 5.3895 5.4732 7.5689 4.8073 4.9971 6.2699 4.5503 1.3319 3.6150 3.8884 2.5624 1.5928 7.1823 5.6740 6.3991 4.4113 5.7089 4.0436 5.6940 5.8562 4.5355 4.5022 4.3806 5.0402 5.8703 4.5296 5.2774 4.5645 5.6269 5.3841 6.0978 5.1319 5.7565 4.8627 3.9784 8.7691 2.1681 3.5178 2.4668 3.8318 1.6118 2.3446 6.7788 2.1803 3.7709 1.9507 2.7877 2.2513 5.3496 4.2882 1.3731 1.4418 1.4552 1.4658 3.8285 3.9010 3.0434 2.2349 2.1512 1.8203 1.4773 1.0857 1.1911 3.2535 1.5205 1.4794 1.4949 1.5097 1.9382 1.6884 1.8765 1.3650 3.3740 1.8876 2.3798 1.9199 5.6649 2.2944 3.0258 3.3830 2.5309 4.2423 4.1912 3.6949 6.7025 4.2913 5.6470 8.8386 6.4889 6.8649 7.2960 7.1992 1.0830 1.0833 1.0896 1.0895 1.0868 1.0910 1.0981 1.0895 1.0980 1.0940 1.0937 1.0659 1.0661
irintensity: 0.3642 0.5500 2.8304 0.0938 0.7378 0.4070 0.3649 4.9584 3.3931 11.5062 59.7144 14.3306 25.1055 82.1147 142.9331 14.7813 6.6844 3.8806 6.0106 7.8290 0.8366 1.6127 0.2775 3.1364 4.8944 1.4490 2.6218 0.4180 2.8739 3.9446 2.1276 0.5524 3.9155 2.4505 4.5257 6.6565 17.8154 10.2343 16.3096 55.0366 5.6018 3.7483 6.5185 0.7013 14.1516 9.8863 20.9010 3.2999 47.3730 25.7326 5.7491 174.3240 29.0022 0.7970 1.2667 2.1689 0.0474 3.7638 18.4803 10.8573 18.4101 2.7969 26.0426 95.6122 15.7827 32.3361 577.1467 14.9158 96.7172 66.7817 3.8718 3.0248 11.7075 15.7700 0.8921 16.7170 30.1259 10.9724 8.1047 1.4313 46.8011 10.7684 6.9613 9.4620 0.5187 3.1254 2.3646 0.6760 30.3699 4.6149 14.0937 3.4192 89.0171 14.6558 3.6425 83.5371 43.3198 0.8011 16.6352 4.1276 6.8912 30.0868 7.3594 28.4068 3.2733 8.0600 7.0356 3.9267
temp: 298.150 k
press: 1.00000 atm
elementType: 8 8 8 8 7 6 6 6 6 6 6 6 6 6 6 6 6 6 6 6 6 6 6 6 6 1 1 1 1 1 1 1 1 1 1 1 1 1
symmnumber: 1
zpe: 734935.9 jmol-1
zpe.correction: 0.279922 hartree
zpe.thermalcorrener: 0.299115 hartree
zpe.thermalcorrenthalpy: 0.300059 hartree
zpe.thermalcorrgfe: 0.231964 hartree
zpe.sumelectzpe: -1123.806797 hartree
zpe.sumelectthermal: -1123.787604 hartree
zpe.sumelectthermalent: -1123.786660 hartree
zpe.sumelectthermalfe: -1123.854755 hartree
dipole: -5.8684 2.6769 -0.0848
dipole: 6.4506
quadrupole: -148.8110 -121.5697 -152.4462
quadrupole: 31.4681 4.7521 -0.6412
quadrupole: -7.8687 19.3726 -11.5039 31.4681 4.7521 -0.6412
hfenergy: -1124.0867197 hartree
pointgroup: C01 [X(C20H13N1O4)]
dipole: 2.3163573 1.0363806 0.0345916 debye
polarizability: 474.3326462|6.1034461|285.1298458|5.0628621|2.5420341|106.2133797 unknown
InChI: InChI=1S/C20H13NO4/c22-16-8-4-12-9-11-2-1-10-3-7-15(21(24)25)13-5-6-14(18(11)17(10)13)19(12)20(16)23/h1-9,16,20,22-23H
charge 0 multiplicity 1
38 atoms
O  3.061441 -1.985215 1.631169
O  4.651314 -1.575056 -1.764451
O  -5.635056 -1.691941 0.07228
O  -3.791057 -2.970695 -0.271527
N  -4.354295 -1.817725 -0.088058
C  2.23269 -0.335381 0.119337
C  0.007611 0.772797 0.039005
C  0.809693 -0.425663 0.086325
C  3.094242 -1.583282 0.203291
C  -1.429764 0.696712 -0.012275
C  2.864805 0.941387 0.13975
C  0.662664 2.058286 0.055441
C  4.557156 -1.400469 -0.293718
C  -2.097238 -0.592983 -0.019089
C  2.075791 2.11377 0.114778
C  -2.196032 1.920877 -0.056803
C  0.111958 -1.688716 0.118373
C  4.331963 1.040154 0.173553
C  -1.26754 -1.777208 0.061686
C  5.138229 -0.039692 -0.007561
C  -0.135499 3.26099 0.011597
C  -1.514811 3.193172 -0.045782
C  -3.532555 -0.585667 -0.070421
C  -3.615878 1.855423 -0.107101
C  -4.273382 0.622637 -0.111081
H  2.652473 -2.390105 -0.422903
H  5.171874 -2.182295 0.210542
H  2.570257 3.092936 0.129981
H  0.689058 -2.612582 0.211648
H  4.768065 2.035252 0.324326
H  -1.75339 -2.751565 0.074293
H  6.228357 0.056715 -0.024943
H  0.375674 4.230397 0.023681
H  -2.118671 4.106644 -0.081154
H  -4.195081 2.784127 -0.144341
H  -5.363101 0.55777 -0.144174
H  3.597361 -2.81428 1.745434
H  4.502674 -2.531526 -1.987209
