program: Gaussian 09
title: 000119565
version: EM64L-G09RevD.01
frameworkgroup: C1[X(C8H18N2O3S)]
method: RPBEPBE
basis: SDD
operation: Freq
keyword: #p
keyword: freq=noraman
keyword: PBEPBE/SDD
title: #p freq=noraman PBEPBE/SDD
converged: YES YES NO NO
title: Mulliken charges:
elementType: S O O O N N C C C C C C C C H H H H H H H H H H H H H H H H H H
charge: 0.764895 -0.591439 -0.424136 -0.223041 -0.649724 -0.616546 -0.570310 -0.597719 -0.419858 -0.294679 -0.145899 -0.345011 -0.689429 0.147535 0.262243 0.272297 0.305268 0.269035 0.277951 0.260160 0.222551 0.238931 0.241391 0.198440 0.199482 0.257812 0.217182 0.218005 0.216286 0.324751 0.290374 0.383203
chargesum: 0.00000
title: Mulliken charges with hydrogens summed into heavy atoms:
elementType: S O O O N N C C C C C C C C
charge: 0.764895 -0.591439 -0.040932 -0.223041 -0.391912 -0.001421 -0.035770 -0.023416 0.118253 0.166803 0.095492 0.052911 -0.037956 0.147535
polarizability: 1.80317796e+02 -1.75327924e+00 1.40545572e+02 -9.43708651e-01 -4.32118080e+00 1.08100548e+02
1716.lowfreq: -11.8239 -4.9648 0.0015 0.0022 0.0025 10.5441 23.4846 37.0684 45.5288
frequency: 22.9985 36.8886 45.4680 70.4249 83.0318 86.2647 121.3553 131.4137 154.4430 176.9657 201.7408 223.3522 229.1106 235.9480 260.2736 281.6459 314.9114 350.0793 378.2339 393.6592 416.7086 432.2674 450.0579 489.2915 511.2272 544.8429 609.8127 615.3447 673.7829 700.1550 744.5132 771.8250 784.1979 805.5091 834.3325 879.8330 894.4368 904.6739 924.7828 959.5315 1027.1547 1029.1719 1054.1384 1067.4664 1091.3578 1094.2257 1107.7762 1142.0073 1171.8140 1187.9965 1204.9986 1212.8625 1252.3699 1255.7756 1278.9482 1291.1691 1299.4135 1309.0368 1316.7968 1338.6616 1344.9110 1366.8000 1394.3880 1415.7914 1423.6527 1439.1668 1473.0931 1477.4818 1479.7300 1491.4814 1657.9275 1661.2433 2949.5601 2971.3158 2978.4897 2983.2834 2997.7938 3016.4993 3017.9775 3035.7581 3061.7494 3062.4214 3077.6598 3077.8138 3120.0496 3127.8035 3257.0066 3330.5630 3504.9733 3526.1912
redmass: 4.4003 6.5977 5.7063 1.6517 4.3500 3.7485 2.6552 3.8698 3.8762 5.7311 4.5001 4.3922 2.0463 1.3124 3.0148 3.5877 4.1638 3.0444 3.0212 3.3385 2.4569 1.4260 1.4699 2.8689 5.5009 2.3583 5.1887 1.7346 3.0545 8.5403 1.0780 2.3799 1.9520 1.6901 1.5474 2.6530 1.8465 2.0240 1.2663 1.9142 3.7088 2.7570 2.1326 2.5906 1.2976 1.2335 2.0096 1.4667 1.3137 1.5965 1.4542 1.3068 1.2102 1.5053 1.1835 1.0710 1.3951 1.2910 1.6292 1.2803 1.4710 1.4470 1.2079 1.1162 1.1074 1.0708 1.0641 1.0419 1.0633 1.0871 1.0939 8.2638 1.0819 1.0584 1.0366 1.0646 1.0604 1.0775 1.0802 1.0577 1.1027 1.0950 1.1005 1.1003 1.1093 1.1100 1.0747 1.0566 1.0642 1.0878
irintensity: 0.6192 0.7799 1.1705 0.1091 1.0836 2.7957 1.3951 4.7604 2.5936 1.8166 7.4138 17.3688 4.5237 0.1740 3.1631 5.8048 20.4890 26.8745 17.7177 18.5473 26.5806 122.7144 57.9183 6.6298 20.7544 38.5789 10.7471 92.7470 42.0995 81.6544 11.0046 111.6718 4.4049 184.4680 66.2404 0.6883 19.1546 115.4082 14.1811 17.1151 16.5781 202.3811 23.5422 3.2668 0.7029 2.1639 23.0267 1.7770 27.9472 7.9451 4.4221 7.9136 12.3315 4.1673 4.5110 0.3702 6.6159 6.3143 3.1087 2.5954 9.2034 0.9848 8.5901 8.8969 3.4903 36.0167 1.2831 12.9107 1.5646 20.0417 94.3868 191.0011 32.9572 32.0796 33.7447 6.3174 15.8013 1.0004 22.5887 9.1614 2.5887 3.7959 58.3940 53.7646 4.4687 5.8528 13.5907 87.6620 14.5459 20.9143
temp: 298.150 k
press: 1.00000 atm
elementType: 16 8 8 8 7 7 6 6 6 6 6 6 6 6 1 1 1 1 1 1 1 1 1 1 1 1 1 1 1 1 1 1
symmnumber: 1
zpe: 689055.3 jmol-1
zpe.correction: 0.262447 hartree
zpe.thermalcorrener: 0.280382 hartree
zpe.thermalcorrenthalpy: 0.281326 hartree
zpe.thermalcorrgfe: 0.215353 hartree
zpe.sumelectzpe: -1047.563223 hartree
zpe.sumelectthermal: -1047.545289 hartree
zpe.sumelectthermalent: -1047.544344 hartree
zpe.sumelectthermalfe: -1047.610318 hartree
dipole: 1.7651 -0.1353 -3.5156
dipole: 3.9361
quadrupole: -84.5475 -96.5210 -98.4207
quadrupole: 11.9217 -0.5443 2.4417
quadrupole: 8.6156 -3.3580 -5.2576 11.9217 -0.5443 2.4417
hfenergy: -1047.8256707 hartree
pointgroup: C01 [X(C8H18N2O3S1)]
dipole: -0.7311985 -0.6190159 1.2166872 debye
polarizability: 179.8960329|3.6317698|132.9474667|2.5635868|14.7898971|116.1204169 unknown
InChI: InChI=1S/C8H18N2O3S/c1-2-3-5-14(10,13)6-4-7(9)8(11)12/h7,10-11H,2-6,9H2,1H3
charge 0 multiplicity 1
32 atoms
S  0.959834 1.485981 0.371148
O  0.502864 1.311827 -1.231153
O  -4.41586 -0.444601 -0.081932
O  -3.276639 -1.715205 -1.658696
N  1.897428 2.794553 0.936586
N  -0.763651 -1.202841 -0.348606
C  -0.743656 1.200884 1.418348
C  2.082616 0.019187 0.87883
C  -1.89701 0.839734 0.491023
C  3.272942 -0.067917 -0.07704
C  -2.00882 -0.685968 0.227252
C  4.177082 -1.276058 0.278192
C  5.37513 -1.397626 -0.688161
C  -3.25186 -1.006086 -0.631725
H  -0.468606 0.419016 2.144937
H  -0.852077 2.179842 1.91326
H  1.392473 -0.840064 0.814122
H  2.366205 0.265462 1.914915
H  -1.758191 1.364363 -0.476391
H  -2.846711 1.195031 0.929369
H  2.904333 -0.171704 -1.115949
H  3.856985 0.869805 -0.0264
H  -2.200452 -1.184192 1.20276
H  3.579295 -2.209342 0.248187
H  4.547498 -1.16972 1.317621
H  1.42767 3.67712 0.613678
H  6.001096 -0.486546 -0.660101
H  6.01633 -2.258288 -0.424339
H  5.031187 -1.53688 -1.729872
H  -0.368579 -0.561503 -1.058641
H  -0.846346 -2.166001 -0.693343
H  -5.203708 -0.705763 -0.632381
