program: Gaussian 09
title: 000119544
version: EM64L-G09RevD.01
frameworkgroup: C1[X(C18H28N2O2)]
method: RPBEPBE
basis: SDD
operation: Freq
keyword: #p
keyword: freq=noraman
keyword: PBEPBE/SDD
title: #p freq=noraman PBEPBE/SDD
converged: YES YES NO NO
title: Mulliken charges:
elementType: O O N N C C C C C C C C C C C C C C C C C C H H H H H H H H H H H H H H H H H H H H H H H H H H H H
charge: -0.197565 -0.438817 -0.080522 -0.624408 0.381054 -0.295787 -0.105310 -0.033182 -0.160888 -0.476978 0.235530 -0.522236 -0.462412 -0.557550 0.135946 -0.622466 -0.832348 -0.668725 -0.503869 -0.076606 -0.771334 0.107382 0.210793 0.256335 0.192231 0.236432 0.211827 0.209251 0.205630 0.206804 0.173128 0.254381 0.200464 0.213146 0.243089 0.257444 0.206939 0.267144 0.211993 0.239349 0.248974 0.208894 0.232533 0.231513 0.245737 0.232400 0.218917 0.318752 0.314973 0.322020
chargesum: 0.00000
title: Mulliken charges with hydrogens summed into heavy atoms:
elementType: O O N N C C C C C C C C C C C C C C C C C C
charge: -0.197565 -0.120065 -0.080522 0.012584 0.381054 -0.084994 0.151024 0.159049 0.075544 -0.055900 0.235530 -0.109802 -0.034903 -0.143940 0.135946 -0.121934 -0.146273 -0.180402 -0.062441 0.154907 -0.074280 0.107382
polarizability: 2.41130722e+02 -1.33028855e+01 1.96944010e+02 -6.46957471e+00 -1.43960147e+00 1.64543848e+02
1716.lowfreq: -11.4966 -3.8125 -0.0004 0.0003 0.0006 8.1835 37.0172 57.6905 75.1071
frequency: 37.0129 57.6413 74.9818 107.6212 125.5024 139.2607 160.9465 176.7375 200.2219 210.0227 223.7853 229.9096 241.3914 258.9008 272.6311 283.1806 296.4553 314.7505 340.5822 346.9067 351.7654 361.2928 377.9997 392.4559 404.6602 410.3458 442.6386 451.0587 474.8845 483.8609 498.9074 502.5016 519.5664 557.2597 579.1725 587.7240 593.5377 621.3148 649.9008 693.6495 740.5158 762.3524 773.8240 792.6911 827.0947 834.0080 871.0103 890.3473 892.0099 909.5595 912.5924 919.0338 940.0114 952.1359 955.1359 975.2294 979.5038 982.8088 1016.9143 1019.2521 1027.1857 1043.9712 1054.9468 1075.3113 1076.6730 1093.1262 1099.5897 1106.4958 1113.4422 1117.9188 1133.4925 1144.5326 1155.8666 1165.4700 1171.1545 1181.2191 1192.2077 1208.2905 1223.3090 1225.9417 1236.9247 1245.4233 1248.4656 1258.6804 1274.0206 1281.9655 1283.9489 1294.5143 1306.6600 1315.8720 1320.4944 1324.1930 1333.7704 1341.1935 1343.5576 1350.5895 1365.7525 1370.3451 1374.9940 1384.1130 1386.6771 1390.3536 1447.6387 1454.5967 1458.1834 1464.8597 1466.1389 1468.7126 1469.4310 1474.5255 1476.7943 1479.3489 1493.4276 1586.3353 1609.2751 1634.5855 2887.7817 2933.0714 2946.0312 2948.6543 2953.8374 2969.4599 2972.1010 2978.1621 2979.1573 2982.1310 2986.9345 2987.6543 2988.3536 3015.5968 3025.9619 3030.1433 3046.4800 3053.7767 3055.5778 3058.2247 3069.4688 3074.0275 3079.9293 3086.7276 3098.6194 3539.6750 3549.1852 3702.9149
redmass: 5.5163 4.3330 4.2574 4.6721 3.4834 3.2456 3.8682 2.7165 2.3792 2.7067 2.0851 1.5360 1.2049 2.5803 2.8375 1.3039 2.1458 3.1805 3.4963 2.2064 1.4035 2.5822 2.5242 2.8290 3.2974 2.5577 2.7274 2.6647 2.1101 2.6830 2.1989 2.9429 2.5494 2.3895 1.8574 2.8469 3.5207 3.1855 3.2897 3.9916 3.4707 2.6353 2.8599 2.4708 2.6335 3.2931 2.1871 2.0669 2.3950 2.0734 1.9406 2.4296 2.1720 2.1334 1.6807 1.8532 1.9614 2.1976 1.9218 2.1537 1.8597 2.3558 2.2619 1.7329 1.9318 1.5712 1.5529 1.9105 1.6146 1.5563 3.0894 2.3426 1.6625 2.0036 1.4267 1.5576 1.9359 1.9145 2.1909 1.6611 1.4681 1.6286 1.7085 1.7130 1.5670 1.5211 1.3742 1.4038 1.3544 1.5237 1.4479 1.4159 1.3747 1.4273 1.4683 1.3875 1.3718 1.6235 1.1915 2.6631 1.3143 1.2746 1.0837 1.1082 1.0837 1.0817 1.0792 1.0893 1.0562 1.0811 1.0533 1.0596 1.0561 1.7876 9.4843 2.3883 1.0783 1.0808 1.0717 1.0771 1.0630 1.0642 1.0631 1.0456 1.0576 1.0592 1.0587 1.0631 1.0634 1.0968 1.1014 1.0921 1.0983 1.1008 1.0933 1.0966 1.0917 1.0995 1.0986 1.0983 1.0979 1.0658 1.0453 1.1037
irintensity: 0.5144 2.9873 0.3990 0.7710 1.2948 1.7796 2.5776 1.8488 1.1336 0.3609 2.6714 1.4574 1.3297 5.2976 1.6199 64.5608 21.4683 12.5824 8.3881 40.1032 109.1736 0.9672 7.0627 9.6475 10.8194 6.4890 7.0321 16.3277 27.0534 19.3616 17.9385 6.5969 0.9974 7.6078 38.9947 7.0484 4.2510 14.3484 10.2437 3.5617 0.5428 7.2384 1.2379 2.2318 10.4289 4.9394 7.7729 0.3817 11.8498 2.3535 1.0802 8.2792 5.1346 8.7861 2.9863 1.5792 0.5332 24.8244 9.5373 7.7015 47.2964 1.8887 10.0754 3.3069 18.4942 11.4548 8.5898 5.3732 6.6639 6.6557 4.1399 13.2661 11.2952 76.2250 4.9337 5.7661 8.2262 14.2527 21.3019 4.3618 9.5951 35.6178 26.2344 18.1712 7.5226 13.0417 1.1401 7.2980 13.1776 2.3247 1.2825 4.9928 3.0305 1.4547 2.3838 1.3845 4.4130 6.4008 40.7153 25.7642 41.9002 31.6757 13.0494 14.8610 6.5135 9.5388 22.7523 4.5202 9.0065 5.6161 6.1233 1.7727 14.9219 37.7865 142.8124 433.6446 10.6864 13.5030 24.5928 15.5808 12.6420 23.1707 41.0806 42.5217 3.9997 41.0563 15.1432 49.3855 20.1671 39.4429 62.1874 20.9803 36.4373 26.0022 85.1330 36.7587 23.6066 40.1080 9.3819 23.9872 11.6617 6.9609 56.7637 31.1999
temp: 298.150 k
press: 1.00000 atm
elementType: 8 8 7 7 6 6 6 6 6 6 6 6 6 6 6 6 6 6 6 6 6 6 1 1 1 1 1 1 1 1 1 1 1 1 1 1 1 1 1 1 1 1 1 1 1 1 1 1 1 1
symmnumber: 1
zpe: 1140191.4 jmol-1
zpe.correction: 0.434276 hartree
zpe.thermalcorrener: 0.455059 hartree
zpe.thermalcorrenthalpy: 0.456003 hartree
zpe.thermalcorrgfe: 0.387532 hartree
zpe.sumelectzpe: -960.951847 hartree
zpe.sumelectthermal: -960.931064 hartree
zpe.sumelectthermalent: -960.930119 hartree
zpe.sumelectthermalfe: -960.998591 hartree
dipole: 3.6461 -4.5782 1.4115
dipole: 6.0205
quadrupole: -134.9859 -139.5223 -134.0285
quadrupole: -17.2223 -8.8130 -1.7003
quadrupole: 1.1930 -3.3434 2.1504 -17.2223 -8.8130 -1.7003
hfenergy: -961.3861225 hartree
pointgroup: C01 [X(C18H28N2O2)]
dipole: -1.4121741 -1.8435079 -0.46657 debye
polarizability: 240.9889065|13.3622967|197.2653561|-6.5276099|-0.3251102|164.3643181 unknown
InChI: InChI=1S/C18H28N2O2/c1-17-6-5-11(21)7-10(17)3-4-12-13-8-15(19)20-18(13,2)9-14(22)16(12)17/h10-13,16,21H,3-9,19H2,1-2H3
charge 0 multiplicity 1
50 atoms
O  0.244958 2.8257 -0.105841
O  4.665999 -0.575191 2.221154
N  -3.960732 0.543973 0.755624
N  -5.455192 -1.302428 0.896053
C  1.772074 0.404582 -0.697919
C  0.36274 0.352433 -0.004435
C  -0.630638 -0.700781 -0.631178
C  2.371096 -1.056015 -0.795129
C  -1.943819 -0.635084 0.158508
C  0.019983 -2.100412 -0.587117
C  -2.615889 0.77586 0.115031
C  1.367371 -2.105308 -1.334693
C  2.743212 1.281642 0.181864
C  3.028564 -1.464649 0.549441
C  -0.305415 1.738643 0.21984
C  -1.694222 1.751192 0.880696
C  1.688666 1.004614 -2.128642
C  -3.144021 -1.569463 -0.127979
C  4.199354 0.772012 0.149559
C  4.32332 -0.640364 0.780848
C  -2.866655 1.321441 -1.316701
C  -4.247791 -0.730693 0.548157
H  0.529379 -0.023382 1.035603
H  -0.821454 -0.437411 -1.69173
H  3.192125 -1.004472 -1.542007
H  -1.690779 -0.808666 1.229176
H  -0.664728 -2.844407 -1.040007
H  0.163851 -2.403168 0.471785
H  1.832139 -3.109702 -1.280716
H  1.173195 -1.909988 -2.408882
H  2.38867 1.28453 1.235684
H  2.681372 2.331809 -0.147941
H  2.331681 -1.285456 1.394202
H  3.262847 -2.545233 0.565807
H  -1.615113 1.419054 1.935055
H  -2.076966 2.78591 0.870231
H  1.101356 0.367998 -2.81592
H  1.237091 2.00954 -2.108821
H  2.705329 1.097093 -2.556777
H  -3.040982 -2.5781 0.310107
H  -3.350379 -1.686982 -1.210367
H  4.564079 0.748514 -0.896073
H  4.872678 1.457443 0.69753
H  5.193917 -1.16889 0.355106
H  -3.510533 2.215132 -1.242253
H  -1.93548 1.61905 -1.832359
H  -3.394365 0.580756 -1.944323
H  3.948608 -0.072466 2.686731
H  -5.614439 -2.300078 0.79664
H  -6.174961 -0.717534 1.316376
