program: Gaussian 09
title: 000119529
version: EM64L-G09RevD.01
frameworkgroup: C1[X(C20H15F)]
method: RPBEPBE
basis: SDD
operation: Freq
keyword: #pfreq=noraman
keyword: PBEPBE/SDD
title: #p freq=noraman PBEPBE/SDD
converged: YES YES NO YES
title: Mulliken charges:
elementType: F C C C C C C C C C C C C C C C C C C C C H H H H H H H H H H H H H H H
charge: -0.208351 0.143888 0.304019 0.022795 -0.021705 0.251129 0.347875 0.136027 0.415247 -0.432261 -0.507717 -0.877779 -0.829289 -0.360727 -0.623388 -0.361878 -0.450773 -0.428116 0.321772 -0.265987 -0.252624 0.252293 0.235450 0.276554 0.225088 0.239465 0.239168 0.239865 0.238483 0.255077 0.255761 0.263528 0.241759 0.255677 0.228654 0.231022
chargesum: 0.00000
title: Mulliken charges with hydrogens summed into heavy atoms:
elementType: F C C C C C C C C C C C C C C C C C C C C
charge: -0.208351 0.143888 0.304019 0.022795 -0.021705 0.251129 0.347875 0.136027 0.415247 -0.179968 -0.272267 -0.136673 -0.111773 -0.105650 -0.367626 -0.098350 -0.209014 -0.172439 0.321772 -0.037333 -0.021602
polarizability: 4.06876015e+02 -2.78149239e+00 2.39521901e+02 6.59731083e-01 4.20661254e+00 9.49863253e+01
1716.lowfreq: -10.3413 -2.6514 -0.0007 -0.0004 -0.0003 2.4658 42.1405 61.5415 98.9094
frequency: 42.1123 61.5399 98.9054 116.9671 144.6860 149.6813 183.2175 221.2959 227.8403 257.1986 284.2622 303.6867 317.9235 346.3262 376.7739 393.5100 404.7694 421.5866 447.9653 453.2037 475.8469 489.2137 521.1686 535.9507 544.0343 580.2758 605.4290 623.2171 632.0723 653.0616 688.2344 696.5477 744.8437 760.9990 765.4091 771.4012 802.5697 815.1822 838.7730 848.2737 866.2429 886.6509 903.9292 946.1960 951.3873 959.3560 979.8881 990.3898 1005.8970 1033.8629 1035.7708 1045.2016 1056.8320 1063.4049 1079.3499 1113.8562 1148.1664 1163.6375 1174.1834 1178.9485 1232.6348 1239.4496 1266.2530 1281.3013 1307.2635 1336.1483 1349.8875 1374.4393 1389.0892 1398.2001 1404.8656 1412.6093 1420.0250 1442.2956 1453.7339 1467.0571 1482.3244 1482.5671 1499.3908 1499.8800 1512.6070 1550.0502 1565.8107 1570.5701 1612.6045 1617.5318 1633.5280 2969.3771 2983.1912 3051.6548 3053.1169 3103.1306 3119.9967 3121.2624 3126.5638 3135.1105 3158.5559 3160.5222 3171.5197 3181.5110 3185.3497 3193.4927
redmass: 5.7462 3.2918 3.1717 4.1161 1.3474 3.4037 3.9955 3.8589 4.8762 3.4575 1.9133 5.0093 3.0927 4.3585 2.2425 4.2243 4.5495 3.7204 3.3782 4.1549 4.8650 5.2695 4.2765 4.2948 3.5351 3.9793 3.3283 5.4084 4.3585 5.9737 5.6742 3.2636 4.3926 1.5307 1.6958 4.1102 2.2780 1.8742 1.9568 4.7553 1.9169 1.5591 4.2842 2.6099 1.3379 1.3669 1.3731 1.3576 3.3490 1.5641 1.5789 2.3140 1.9858 2.3392 2.3882 2.0831 1.4977 2.4400 1.3546 1.1013 1.9353 1.7332 1.6857 1.8963 3.2054 3.8572 3.3213 3.9585 8.0280 1.2648 1.1969 3.0034 2.9390 4.8360 2.2917 1.6149 1.0852 1.1825 1.2576 2.2940 1.6577 5.6130 5.5115 8.4775 6.1263 6.6509 6.8741 1.0440 1.0419 1.0975 1.0921 1.0966 1.0928 1.0872 1.0887 1.0902 1.0983 1.0869 1.0942 1.0964 1.0914 1.0929
irintensity: 0.1013 0.0440 0.5910 0.0730 1.8412 2.6366 0.0289 2.2725 1.8170 0.5266 1.2894 0.0282 1.2205 0.2251 2.5693 1.6919 2.4695 2.7007 1.1864 1.0691 3.2801 9.2263 7.8871 1.3740 11.9049 4.4238 0.0583 1.2988 2.7923 0.6816 1.0804 4.7104 12.9431 29.7055 16.8054 2.5737 14.0665 78.1360 13.7318 17.6642 33.5400 8.5164 3.1925 52.3276 0.1760 3.3479 1.8892 0.4974 1.6244 3.2448 0.5516 6.5570 1.2061 1.6253 2.7686 0.7353 21.5392 76.9545 4.4347 1.8686 8.8347 2.7469 5.6787 7.0587 11.3344 2.0068 7.9108 11.6259 2.9327 17.9939 13.7280 2.3500 3.7142 27.5769 3.4872 3.6057 6.8751 9.4020 23.9971 31.9331 55.7157 7.4312 0.5250 6.2320 2.7769 49.5720 46.2225 30.0275 32.7176 16.2507 20.7961 9.1997 17.2853 2.6245 8.4504 15.8825 42.8500 2.0839 21.9676 8.0171 10.2261 11.6770
temp: 298.150 k
press: 1.00000 atm
elementType: 9 6 6 6 6 6 6 6 6 6 6 6 6 6 6 6 6 6 6 6 6 1 1 1 1 1 1 1 1 1 1 1 1 1 1 1
symmnumber: 1
zpe: 746144.3 jmol-1
zpe.correction: 0.284191 hartree
zpe.thermalcorrener: 0.300519 hartree
zpe.thermalcorrenthalpy: 0.301463 hartree
zpe.thermalcorrgfe: 0.241176 hartree
zpe.sumelectzpe: -869.574663 hartree
zpe.sumelectthermal: -869.558336 hartree
zpe.sumelectthermalent: -869.557392 hartree
zpe.sumelectthermalfe: -869.617679 hartree
dipole: -2.4979 -0.2654 0.2544
dipole: 2.5248
quadrupole: -126.0599 -102.1922 -127.7905
quadrupole: -1.2892 1.8253 0.8701
quadrupole: -7.3790 16.4886 -9.1096 -1.2892 1.8253 0.8701
hfenergy: -869.8588546 hartree
pointgroup: C01 [X(C20H15F1)]
dipole: 0.9803115 0.1118303 0.1150173 debye
polarizability: 406.8251237|-1.7644495|239.2495513|4.9023556|-7.3394294|95.3095663 unknown
InChI: InChI=1S/C20H15F/c1-12-17-9-7-14-5-3-4-6-18(14)20(17)13(2)16-10-8-15(21)11-19(12)16/h3-11H,1-2H3
charge 0 multiplicity 1
36 atoms
F  -5.747837 0.036621 -0.511349
C  0.730276 0.126976 0.065878
C  0.261486 -1.259189 0.064934
C  -0.232417 1.167921 0.209793
C  -1.121756 -1.584021 -0.019741
C  -1.629722 0.856746 0.062308
C  -2.079911 -0.522272 -0.100636
C  2.186816 0.362993 -0.056819
C  3.104995 -0.732563 0.139745
C  1.238898 -2.324391 0.219719
C  2.587501 -2.071348 0.320108
C  0.136377 2.58656 0.630782
C  -1.55025 -3.044482 -0.008509
C  -2.618625 1.905491 0.044229
C  -3.48706 -0.765726 -0.294123
C  2.755047 1.61213 -0.46031
C  4.513323 -0.518348 0.071372
C  -3.974126 1.648155 -0.143587
C  -4.373918 0.295376 -0.311117
C  4.144889 1.802171 -0.550924
C  5.038631 0.740783 -0.250018
H  0.885191 -3.356463 0.282088
H  3.299248 -2.89057 0.476826
H  1.123286 2.616834 1.115729
H  0.150152 3.308034 -0.210321
H  -0.595949 2.961403 1.366948
H  -2.639027 -3.168607 -0.085901
H  -1.096605 -3.608025 -0.845073
H  -1.240468 -3.543548 0.929092
H  -2.299245 2.945157 0.147302
H  -3.878823 -1.773799 -0.440614
H  2.103649 2.433456 -0.761551
H  5.182742 -1.369172 0.24621
H  -4.72054 2.446627 -0.175611
H  4.537137 2.773643 -0.871431
H  6.121435 0.895946 -0.304928
