program: Gaussian 09
title: 000119553
version: EM64L-G09RevD.01
frameworkgroup: C1[X(C22H26N2O2)]
method: RPBEPBE
basis: SDD
operation: Freq
keyword: #p
keyword: freq=noraman
keyword: PBEPBE/SDD
title: #p freq=noraman PBEPBE/SDD
converged: YES YES NO NO
title: Mulliken charges:
elementType: O O N N C C C C C C C C C C C C C C C C C C C C C C H H H H H H H H H H H H H H H H H H H H H H H H H H
charge: -0.417647 -0.230540 -0.236674 0.003535 -0.455071 -0.378842 -0.366027 0.153222 0.213828 -0.391575 0.116008 0.187112 -0.369490 -0.376659 0.294340 -0.365080 -0.417048 -0.819438 -0.487932 -0.236225 -0.252969 -0.328849 -0.500303 -0.189466 0.171501 -0.347370 0.244268 0.219625 0.224702 0.215109 0.191378 0.199570 0.202321 0.201481 0.192393 0.194265 0.218734 0.219198 0.235242 0.235467 0.229140 0.242517 0.233708 0.252398 0.252857 0.219989 0.220724 0.264007 0.266147 0.231722 0.244964 0.375732
chargesum: 0.00000
title: Mulliken charges with hydrogens summed into heavy atoms:
elementType: O O N N C C C C C C C C C C C C C C C C C C C C C C
charge: -0.041915 -0.230540 -0.236674 0.003535 0.008821 0.060969 0.024921 0.153222 0.213828 0.012228 0.116008 0.187112 0.017168 0.061273 0.294340 -0.129838 -0.181581 -0.114073 0.017324 -0.016237 -0.032246 -0.064842 -0.234155 0.042256 0.171501 -0.102407
polarizability: 2.55867183e+02 2.74382190e+01 3.43392038e+02 -3.18657977e+01 1.51791693e+00 2.02834981e+02
1716.lowfreq: -3.1331 -0.0004 -0.0002 0.0007 2.2134 6.8311 9.3709 14.4185 22.7204
frequency: 9.1682 14.3915 22.7085 32.1169 44.0931 46.6284 59.0983 63.1382 76.8529 86.2695 100.7366 126.3541 134.5372 138.9969 142.0474 147.3868 163.9070 196.5424 229.8846 234.4485 251.4599 270.8983 279.5288 307.9435 363.7196 371.1203 381.5769 404.8541 445.8026 459.7478 489.5619 498.8296 500.8467 536.4261 565.8442 581.8722 588.7108 606.7380 612.6294 636.7728 641.8323 677.5842 700.1129 724.2538 727.5778 735.9911 749.7611 757.8001 758.5943 796.3563 799.3933 821.7800 838.1008 849.4369 856.5924 903.7161 931.1042 931.8068 946.6517 970.6914 980.8999 985.6212 990.6862 996.0895 1002.2977 1010.8188 1013.3852 1016.9982 1039.0176 1039.8272 1042.9218 1059.9197 1073.3318 1081.0244 1082.3307 1102.9430 1110.5853 1116.2112 1127.6004 1148.4465 1171.5023 1197.9682 1204.5202 1214.8159 1230.8598 1242.6210 1254.8054 1260.3518 1273.8800 1281.2778 1288.6020 1295.1753 1299.0273 1301.0799 1312.2581 1329.4109 1341.4884 1344.9123 1349.6724 1359.8732 1369.3248 1372.9170 1394.2272 1400.0689 1404.2511 1414.6613 1437.5849 1453.7475 1462.5913 1463.9349 1467.0290 1469.5680 1470.0907 1473.7391 1477.4109 1481.4163 1485.3864 1492.2355 1539.6332 1560.7444 1580.9271 1590.9658 1621.1283 1669.6032 2950.4608 2952.0920 2963.3157 2966.1406 2981.0470 2985.7346 2988.4527 2995.3778 2998.6499 3007.7002 3023.9974 3031.8547 3036.6962 3043.2963 3061.8950 3078.1597 3082.2971 3122.1120 3123.4564 3132.3074 3132.8771 3144.9487 3145.4963 3162.0650 3167.4844 3511.3501
redmass: 6.7150 9.3341 4.9251 4.5875 2.9885 2.1056 4.8386 3.8909 4.0486 3.5325 1.7699 5.3827 2.1915 1.5050 2.8887 2.0090 2.4377 4.7340 3.9886 3.1725 4.1094 3.8012 4.3335 3.1692 4.3856 4.6613 4.1053 3.1650 3.3362 3.8011 3.5068 4.2280 1.7839 4.9979 5.4194 4.1231 4.7021 5.9883 4.5620 1.3225 4.8629 5.4101 6.2053 1.0820 1.9925 1.1126 1.3610 3.4486 1.3621 2.0945 2.8352 1.7960 1.9151 1.4396 4.8277 1.4164 1.3155 1.3733 1.4653 1.2982 2.1366 3.0835 1.6217 1.7945 4.0651 2.7599 3.5933 3.4343 2.9166 1.5465 1.9304 2.7395 2.6409 2.2581 2.2098 3.6346 1.6520 1.4870 1.5926 1.6412 1.1653 1.3967 1.6988 1.2689 1.7576 1.4289 2.3194 1.3649 1.4112 1.0533 1.2106 1.0891 1.5851 3.0609 1.4424 1.3918 1.6806 2.0436 2.1245 1.6627 1.4569 1.8247 1.9129 1.6510 2.0595 4.4042 1.0847 2.4649 1.0760 1.0755 1.8150 1.4568 1.2359 1.4239 1.1315 1.5902 1.1138 1.1135 5.0286 6.5344 6.7247 6.4595 7.3679 8.2416 1.0591 1.0588 1.0593 1.0387 1.0594 1.0613 1.0973 1.0596 1.1008 1.0640 1.1016 1.1004 1.0969 1.1021 1.1032 1.1013 1.0970 1.0908 1.0845 1.0887 1.0879 1.0922 1.0952 1.1001 1.1004 1.0639
irintensity: 0.3845 1.0488 0.3767 0.0641 0.0834 0.0744 0.1546 3.1932 0.1791 0.3354 0.1324 2.2933 0.1020 0.8376 0.6336 0.1260 2.3912 1.1046 0.2232 0.3769 1.8869 1.4059 4.1865 2.1402 3.1315 7.1666 4.8299 1.4160 5.0502 2.4430 21.8508 0.1702 28.9832 2.8920 3.5155 5.1923 14.0907 3.0512 0.8920 125.5444 3.6283 5.8762 0.1063 16.1693 33.0769 0.9857 98.6506 4.5791 7.7230 2.5113 3.4778 29.1453 10.1139 0.1993 1.3923 3.0145 0.9342 2.5842 3.6068 0.0375 9.5506 10.3513 11.1179 13.4643 63.3299 7.6918 3.9681 16.6342 112.6849 21.5280 1.7080 51.4201 3.9146 2.5554 5.2691 20.6146 6.5052 0.4488 6.8710 6.7411 2.1636 4.0519 11.2633 33.9544 15.6823 2.8317 0.1974 2.9241 11.0019 0.4568 0.0822 0.1184 0.2394 1.5144 17.7621 7.4046 11.5016 85.8817 13.3925 0.4128 1.4515 30.5926 10.0062 24.4593 10.3080 41.7581 27.2025 32.1213 0.2209 0.3001 0.5171 5.4826 8.6254 11.3638 7.0093 15.0744 6.1410 31.8126 10.9106 2.8104 2.9424 28.2772 2.1863 204.5762 0.1102 16.0264 54.5445 46.4670 19.9222 5.1344 3.6080 37.6192 0.3665 45.2861 13.8153 2.4515 20.6807 37.8704 72.6395 35.0966 20.2613 17.7239 0.9988 3.6796 1.3536 20.8782 39.5526 39.4262 23.2782 18.7149
temp: 298.150 k
press: 1.00000 atm
elementType: 8 8 7 7 6 6 6 6 6 6 6 6 6 6 6 6 6 6 6 6 6 6 6 6 6 6 1 1 1 1 1 1 1 1 1 1 1 1 1 1 1 1 1 1 1 1 1 1 1 1 1 1
symmnumber: 1
zpe: 1132031.2 jmol-1
zpe.correction: 0.431168 hartree
zpe.thermalcorrener: 0.456824 hartree
zpe.thermalcorrenthalpy: 0.457768 hartree
zpe.thermalcorrgfe: 0.370042 hartree
zpe.sumelectzpe: -1112.010588 hartree
zpe.sumelectthermal: -1111.984932 hartree
zpe.sumelectthermalent: -1111.983988 hartree
zpe.sumelectthermalfe: -1112.071714 hartree
dipole: 1.2606 0.2073 0.4138
dipole: 1.3429
quadrupole: -153.6276 -153.1626 -160.0966
quadrupole: 1.9578 -20.0612 14.1402
quadrupole: 2.0013 2.4663 -4.4677 1.9578 -20.0612 14.1402
hfenergy: -1112.441756 hartree
pointgroup: C01 [X(C22H26N2O2)]
dipole: 0.5022199 -0.0498985 -0.1562289 debye
polarizability: 258.8962438|-32.7952521|339.5417038|32.4756298|2.9343532|203.6562545 unknown
InChI: InChI=1S/C22H26N2O2/c1-17-19-11-6-7-12-20(19)24(22(17)18-10-9-14-23-16-18)15-8-4-2-3-5-13-21(25)26/h6-7,9-12,14,16,25H,2-5,8,13,15H2,1H3
charge 0 multiplicity 1
52 atoms
O  9.332586 0.539104 0.237266
O  8.081887 0.986774 -1.66642
N  -2.039325 0.368942 0.656804
N  -2.041881 -4.047876 1.365439
C  -0.718032 0.189202 1.285829
C  0.45932 0.437666 0.312306
C  1.829904 0.276068 1.005616
C  -2.764191 -0.604172 -0.087816
C  -2.606189 1.625425 0.402652
C  3.018056 0.521835 0.048627
C  -3.807083 0.02564 -0.789834
C  -3.724365 1.438476 -0.483114
C  4.393461 0.360839 0.733844
C  5.574394 0.61327 -0.228684
C  -2.455369 -2.044295 -0.012648
C  -2.230855 2.904504 0.873663
C  -4.498004 2.563679 -0.873512
C  -4.87283 -0.624283 -1.634476
C  6.937253 0.448548 0.469749
C  -3.011269 4.005515 0.466042
C  -4.135631 3.837896 -0.396876
C  -2.32306 -2.836677 -1.186417
C  -2.316234 -2.719369 1.236744
C  -2.05777 -4.217723 -1.071314
C  8.11579 0.690732 -0.452393
C  -1.912829 -4.77985 0.21764
H  -0.646653 -0.833312 1.692572
H  -0.65065 0.882014 2.145932
H  0.372389 1.454863 -0.117103
H  0.381338 -0.274387 -0.533054
H  1.898544 0.980952 1.861166
H  1.910541 -0.744631 1.434717
H  2.950258 -0.180724 -0.807556
H  2.93846 1.54232 -0.379862
H  4.457847 1.061386 1.593011
H  4.472111 -0.661822 1.158987
H  5.500973 1.631901 -0.655545
H  5.515254 -0.081981 -1.087913
H  -1.372127 3.047295 1.538348
H  -5.359913 2.443539 -1.53958
H  -4.752306 -0.37805 -2.707854
H  -4.857819 -1.723131 -1.538115
H  -5.880023 -0.276556 -1.336127
H  7.032058 1.141443 1.329063
H  7.046233 -0.568036 0.896876
H  -2.751004 5.009481 0.819918
H  -4.719765 4.717282 -0.690219
H  -2.411158 -2.36396 -2.170356
H  -2.460921 -2.173108 2.176824
H  -1.951857 -4.846727 -1.960863
H  -1.691425 -5.844703 0.35077
H  10.08588 0.703183 -0.393255
