program: Gaussian 09
title: 000119484
version: EM64L-G09RevD.01
frameworkgroup: C1[X(C11H18N2O8)]
method: RPBEPBE
basis: SDD
operation: Freq
keyword: #p
keyword: freq=noraman
keyword: PBEPBE/SDD
title: #p freq=noraman PBEPBE/SDD
converged: YES YES NO NO
title: Mulliken charges:
elementType: O O O O O O O O N N C C C C C C C C C C C H H H H H H H H H H H H H H H H H H
charge: -0.241130 -0.414492 -0.409162 -0.414900 -0.446308 -0.236017 -0.251682 -0.230675 -0.102687 -0.107920 -0.358445 -0.395702 -0.483109 -0.451291 -0.440258 -0.433011 0.191925 0.196081 0.208610 0.194004 -0.364304 0.242654 0.206219 0.261888 0.217365 0.224060 0.296614 0.231587 0.302184 0.291762 0.234889 0.275611 0.237457 0.228353 0.230923 0.380217 0.381981 0.382429 0.364285
chargesum: 0.00000
title: Mulliken charges with hydrogens summed into heavy atoms:
elementType: O O O O O O O O N N C C C C C C C C C C C
charge: -0.241130 -0.034276 -0.027181 -0.032472 -0.082023 -0.236017 -0.251682 -0.230675 -0.102687 -0.107920 0.090429 0.083551 0.037565 0.082479 0.086393 0.080057 0.191925 0.196081 0.208610 0.194004 0.094971
polarizability: 1.79401573e+02 -1.71197273e+00 1.80769372e+02 4.22618672e+00 -6.05017705e+00 1.18573153e+02
1716.lowfreq: -10.5964 -4.3511 0.0005 0.0008 0.0009 4.5993 13.3052 18.6947 29.7877
frequency: 10.2158 18.6508 29.7674 32.8247 39.9962 41.3285 45.6794 49.6924 55.7471 60.8037 65.6466 101.8128 152.1004 156.0887 184.5752 191.2446 220.2317 234.4006 242.2741 277.9809 292.7729 313.3759 327.6073 343.4667 371.7941 388.8191 397.5397 462.0328 475.3862 480.6426 483.6093 495.1797 504.5516 515.0110 596.0468 608.3969 622.4296 630.0863 635.1364 650.3110 689.7877 765.9140 796.4047 821.0498 833.9810 859.9269 877.9849 899.3413 908.7258 965.1352 970.7264 978.7184 999.9384 1019.2731 1028.5492 1038.6888 1047.8698 1053.9177 1067.4999 1103.6068 1143.6787 1151.6415 1160.0166 1182.6291 1219.0806 1241.6453 1245.2909 1246.3249 1253.5014 1261.1344 1267.6750 1283.1351 1289.5983 1295.9915 1321.2516 1341.8685 1374.7827 1376.2620 1379.3022 1390.4583 1394.7716 1395.7784 1431.8084 1432.5259 1443.1206 1445.0126 1450.4286 1476.9026 1483.4207 1623.0451 1663.8638 1673.0676 1675.1325 2793.9851 2844.5182 2850.5060 2856.7404 2935.3376 2962.6882 2976.5539 3006.4936 3019.4775 3044.2011 3049.1644 3051.4780 3057.0167 3077.6020 3425.3309 3515.6434 3519.6076 3520.3128
redmass: 7.3369 7.1328 6.7460 7.7078 8.7182 5.4113 6.6776 11.1635 6.1062 6.0103 6.4706 3.3894 3.4681 2.6440 3.2322 3.0217 4.8153 4.4002 5.4033 3.1558 4.6945 3.2602 4.1566 3.8245 3.2287 3.7830 1.5090 2.0844 1.8848 2.1857 2.4187 2.3694 2.7126 3.4094 3.7723 3.2108 1.6915 1.7104 1.4486 2.9966 3.9890 1.3068 2.0086 4.7906 4.1793 4.0479 4.2770 3.9689 3.0099 2.6269 2.4699 2.3006 3.0990 2.6966 2.9911 2.5636 2.5661 2.8269 2.2691 2.2843 1.9725 1.8042 1.6454 1.3009 1.5207 1.1978 1.3763 1.4073 1.3813 1.5852 1.3439 1.8631 2.1088 1.5053 1.4895 1.6682 1.3460 1.3769 1.5984 1.5246 1.5334 1.5171 1.0968 1.0960 1.0858 1.1110 1.0959 1.1103 1.0861 7.4578 8.1982 8.3098 8.3836 1.0702 1.0713 1.0702 1.0704 1.0667 1.0644 1.0669 1.0916 1.0857 1.0959 1.0856 1.0846 1.0856 1.0974 1.0643 1.0641 1.0642 1.0641
irintensity: 0.5463 0.4002 1.9510 0.3501 0.2786 1.2145 0.2216 1.3277 1.4432 0.3343 2.4001 10.4390 0.5911 5.0578 3.6929 5.3128 2.9691 3.3571 4.8297 0.3136 1.0604 21.4744 19.3582 8.5170 9.5675 1.8412 79.5763 45.3157 25.8471 15.1083 37.6154 4.4599 87.2783 9.8067 47.3553 25.4455 72.7763 60.4964 207.8703 36.9824 4.5282 16.3249 2.4507 20.7939 7.8675 0.4204 15.6155 3.4577 14.0956 65.7150 102.5831 51.4061 25.9662 39.9904 433.6296 545.6010 106.6693 15.4368 16.8055 13.6695 56.2775 1.4323 34.9393 30.1881 7.6248 28.5671 8.9993 35.0915 87.4431 14.8211 1.7668 0.7571 18.9801 19.8311 4.1768 20.2407 12.6392 89.3490 18.3539 12.2163 3.9685 30.4782 53.0549 2.6329 7.4887 15.6545 19.1847 0.2009 12.8770 77.4450 234.0012 280.9389 196.4336 87.0527 65.3344 111.0208 81.0878 45.2490 14.4387 56.0001 22.3574 11.2149 18.8469 11.6991 8.5568 3.9598 34.1704 25.7317 27.9769 33.8797 28.0783
temp: 298.150 k
press: 1.00000 atm
elementType: 8 8 8 8 8 8 8 8 7 7 6 6 6 6 6 6 6 6 6 6 6 1 1 1 1 1 1 1 1 1 1 1 1 1 1 1 1 1 1
symmnumber: 1
zpe: 783871.6 jmol-1
zpe.correction: 0.298561 hartree
zpe.thermalcorrener: 0.322376 hartree
zpe.thermalcorrenthalpy: 0.323320 hartree
zpe.thermalcorrgfe: 0.239013 hartree
zpe.sumelectzpe: -1139.572795 hartree
zpe.sumelectthermal: -1139.548980 hartree
zpe.sumelectthermalent: -1139.548036 hartree
zpe.sumelectthermalfe: -1139.632343 hartree
dipole: -3.4466 1.1426 0.6732
dipole: 3.6929
quadrupole: -137.2269 -112.4813 -123.7558
quadrupole: 4.1332 7.2551 2.4385
quadrupole: -12.7389 12.0067 0.7322 4.1332 7.2551 2.4385
hfenergy: -1139.8713556 hartree
pointgroup: C01 [X(C11H18N2O8)]
dipole: -1.3646416 -0.4750344 -0.1517198 debye
polarizability: 178.9253312|0.6331229|178.4561651|-6.89402|-13.2525517|121.3626007 unknown
InChI: InChI=1S/C11H18N2O8/c14-7-8(15)3-12(4-9(16)17)1-2-13(5-10(18)19)6-11(20)21/h14,16,18,20H,1-7H2
charge 0 multiplicity 1
39 atoms
O  4.255513 0.189839 0.2032
O  2.676081 -4.208114 0.210429
O  -2.303671 3.895107 0.019411
O  -4.98638 -2.004393 0.223008
O  5.194928 2.663756 -0.29351
O  1.072787 -2.971372 1.346676
O  -0.722037 2.488282 -0.925681
O  -4.680893 0.029361 -0.857375
N  1.547764 -0.745096 -0.436912
N  -2.029281 0.222751 0.366605
C  0.070154 -0.785007 -0.568114
C  -0.608422 -0.105107 0.647142
C  2.149767 0.434637 -1.064148
C  2.273286 -2.001418 -0.618289
C  -2.460557 1.593439 0.63845
C  -2.97767 -0.81742 0.762446
C  3.460752 0.917763 -0.455413
C  1.91202 -3.049997 0.425578
C  -1.718538 2.639348 -0.185093
C  -4.262497 -0.836866 -0.061995
C  3.835616 2.38347 -0.698365
H  -0.276322 -0.26132 -1.48323
H  -0.261354 -1.836541 -0.643799
H  -0.490446 -0.75777 1.536839
H  -0.060858 0.827682 0.862219
H  2.361788 0.290342 -2.160748
H  1.417886 1.264496 -1.026188
H  2.126235 -2.477938 -1.62097
H  3.355829 -1.811181 -0.509793
H  -3.529454 1.698159 0.381318
H  -2.355692 1.903657 1.710375
H  -2.499013 -1.805411 0.646991
H  -3.291844 -0.764812 1.837122
H  3.115429 3.011044 -0.126114
H  3.708749 2.633364 -1.770608
H  2.444517 -4.886161 0.901362
H  -1.813572 4.580833 -0.510229
H  -5.83908 -1.999237 -0.290998
H  5.51128 1.866932 0.220699
