program: Gaussian 09
title: 000119363
version: EM64L-G09RevD.01
frameworkgroup: C1[X(C12H2Br6O)]
method: RPBEPBE
basis: SDD
operation: Freq
keyword: #p
keyword: freq=noraman
keyword: PBEPBE/SDD
title: #p freq=noraman PBEPBE/SDD
converged: NO YES NO NO
title: Mulliken charges:
elementType: Br Br Br Br Br Br O C C C C C C C C C C C C H H
charge: 0.098755 0.122888 0.124951 0.132103 0.072455 0.086686 -0.234090 0.411951 0.255578 0.367675 0.171724 -0.385552 -0.286685 -0.405778 -0.302476 -0.217847 -0.195505 -0.216127 -0.174897 0.283741 0.290452
chargesum: 0.00000
title: Mulliken charges with hydrogens summed into heavy atoms:
elementType: Br Br Br Br Br Br O C C C C C C C C C C C C
charge: 0.098755 0.122888 0.124951 0.132103 0.072455 0.086686 -0.234090 0.411951 0.255578 0.367675 0.171724 -0.385552 -0.002944 -0.405778 -0.012025 -0.217847 -0.195505 -0.216127 -0.174897
polarizability: 4.21862903e+02 2.02138430e+00 2.76404528e+02 -1.81502029e-03 -2.15705730e-02 7.99578032e+01
1716.lowfreq: -3.3212 -2.4921 -0.0005 -0.0003 -0.0003 1.7658 26.1265 28.8556 43.8768
frequency: 26.1256 28.8547 43.8763 56.9913 62.3249 108.5871 128.1047 134.7094 139.9997 144.8747 148.9597 160.2819 173.9982 208.5859 216.3217 242.7877 284.6406 306.9974 345.8252 372.2169 385.4686 392.6343 436.6431 503.9172 582.1421 582.3501 613.4379 619.8434 638.6620 651.8565 689.0864 714.8329 735.5340 766.4173 818.4653 863.5319 868.9504 896.5464 897.4636 1012.1033 1077.5566 1129.2862 1170.3983 1212.5453 1231.4825 1280.5256 1334.8694 1352.1779 1363.8702 1387.9586 1433.3534 1527.9949 1571.9946 1572.0694 1621.1405 3187.3041 3196.8981
redmass: 46.3253 53.0539 74.1298 16.0507 44.3175 67.3866 56.5043 56.6771 8.2288 77.9128 8.6857 35.4422 48.6028 68.2106 68.3861 9.2380 14.9069 10.2441 14.8939 11.4248 10.1980 8.6691 3.1193 10.7314 8.5483 11.7536 11.6350 9.2514 9.1924 9.8253 9.1994 5.0302 12.7448 7.9582 7.7324 11.3287 1.4394 1.4642 12.5530 9.6099 1.9032 9.9355 9.3791 6.8947 1.3128 10.9458 7.9188 9.2959 6.5753 5.8595 4.2269 11.1139 11.1886 10.0101 9.5511 1.0939 1.0928
irintensity: 0.0002 0.0002 0.0007 0.0070 0.0187 0.0086 0.5074 0.2525 0.2077 0.0574 0.2175 0.1819 0.0038 0.1406 0.0548 1.0372 0.8916 0.9060 10.1557 0.4432 3.0601 4.8464 12.5125 19.4397 3.4544 1.4010 0.9292 5.4002 0.3086 22.3574 5.0525 0.2862 50.7730 0.1073 29.5996 20.7906 15.4067 27.0623 72.3112 102.0799 61.4897 6.0556 17.7868 71.3974 8.2116 151.1554 132.1508 8.2093 67.0127 107.0937 53.5698 1.5124 43.6377 5.6016 17.6012 1.2582 1.6257
temp: 298.150 k
press: 1.00000 atm
elementType: 35 35 35 35 35 35 8 6 6 6 6 6 6 6 6 6 6 6 6 1 1
symmnumber: 1
zpe: 261123.1 jmol-1
zpe.correction: 0.099457 hartree
zpe.thermalcorrener: 0.117896 hartree
zpe.thermalcorrenthalpy: 0.118840 hartree
zpe.thermalcorrgfe: 0.047155 hartree
zpe.sumelectzpe: -613.135051 hartree
zpe.sumelectthermal: -613.116612 hartree
zpe.sumelectthermalent: -613.115668 hartree
zpe.sumelectthermalfe: -613.187353 hartree
dipole: 0.1820 0.1055 -0.0002
dipole: 0.2104
quadrupole: -165.8712 -156.6465 -166.5611
quadrupole: -1.1947 -0.0011 -0.0011
quadrupole: -2.8450 6.3798 -3.5348 -1.1947 -0.0011 -0.0011
hfenergy: -613.234508 hartree
pointgroup: C01 [X(C12H2Br6O1)]
dipole: -0.0701704 -0.0438922 -0.0000601 debye
dipolederiv: -0.0401968 -0.2293244 -0.0000199 -0.0803488 -0.5154753 -0.000061 0.0000032 -0.0000143 0.0352821 0.0291521 -0.0998375 -0.0000143 -0.1930584 -0.5494522 -0.0001001 -0.0000476 -0.0001633 0.0601713 -0.2872035 0.3046134 0.0000124 0.3861065 -0.2530193 -0.0000106 -0.0000253 0.0000239 0.049399 -0.6747014 -0.1646569 -0.0000509 -0.2037398 0.0415674 -0.000009 -0.0001135 -0.0000221 0.0560607 -0.3714973 -0.2602487 -0.0000146 -0.4196486 -0.2665367 -0.000015 -0.000031 -0.0000191 0.0153902 -0.705598 0.2260302 0.0000375 0.3302181 -0.0763503 -0.0000168 0.0000481 -0.0000128 0.0227826 -1.4987596 0.0344724 0.0000175 0.0784862 -0.4477098 -0.0000232 0.0000342 -0.0000405 -0.1295497 0.1613528 -0.2761361 -0.0000465 0.19129 -0.2996347 -0.0000367 -0.0000002 -0.0000033 0.0561834 0.0867627 0.0999017 0.0000051 -0.162977 -0.1013701 -0.0000103 -0.0000313 -0.0000194 0.0067691 0.6012421 -0.1798084 -0.0000265 -0.8737223 -0.0140394 -0.0000318 -0.0001075 -0.0000701 0.1336235 0.8271316 0.1934172 0.0000063 0.5699454 0.2462433 0.0000159 0.0000748 0.0000284 0.0755574 0.0994013 0.459115 0.0000343 0.2260075 0.8211275 0.0000993 -0.0000149 0.000036 -0.0986615 -0.04169 -0.2367873 -0.0000271 0.0039367 -0.1060003 -0.0000039 0.0000009 0.0000009 -0.0581429 -0.2280644 0.2805344 0.0000374 0.3209306 0.9821589 0.0002076 0.0000419 0.0003025 -0.1264079 -0.4301283 0.0115291 0.0000045 -0.0417722 -0.0545378 -0.0000018 0.0000006 0.0000033 -0.0892599 0.1184866 -0.6925921 -0.0000317 -0.9089712 0.2210347 -0.0000298 -0.000011 -0.0000432 -0.0634123 0.8865306 0.2888688 0.0000897 0.4875821 -0.2179705 -0.0000095 0.0001721 -0.0000151 -0.0667335 0.2687104 0.8255017 0.0000626 0.9284484 0.3782748 0.0000243 0.0000718 0.0000193 -0.1069922 0.976674 -0.6058814 -0.0000855 -0.6372882 0.1596368 0.0000383 -0.0000754 0.0000374 -0.108221 0.1354532 0.0357462 0.0000073 -0.0158758 0.0231943 -0.0000121 0.0000074 -0.0000136 0.1551816 0.0869422 -0.0144574 0.0000022 0.0144509 0.0288586 -0.0000139 0.0000025 -0.0000151 0.1809801 unknown
polarizability: 421.5603489|6.9284553|276.7070819|0.0010852|0.0216196|79.9578032 unknown
InChI: InChI=1S/C12H2Br6O/c13-4-1-3-6(2-5(4)14)19-12-7(3)8(15)9(16)10(17)11(12)18/h1-2H
charge 0 multiplicity 1
21 atoms
Br -0.893301 3.256647 0.000362
Br -2.726546 -3.235259 -0.00048
Br -4.193271 2.468629 0.000138
Br -5.14391 -0.785974 -0.000229
Br 4.768206 2.125249 0.000063
Br 5.466594 -1.281445 -0.00027
O  0.13178 -1.87813 -0.00015
C  -0.50079 0.382077 0.000167
C  0.96277 0.317758 0.000071
C  -0.94729 -0.973348 -0.000007
C  1.293029 -1.068504 -0.000079
C  -1.477907 1.403273 0.000277
C  2.018799 1.25635 0.0001
C  -2.295763 -1.351354 -0.000051
C  2.59825 -1.563359 -0.000193
C  -2.854588 1.060332 0.0002
C  -3.263425 -0.313524 0.000034
C  3.349808 0.786589 -0.000015
C  3.640533 -0.608574 -0.000154
H  1.822823 2.329291 0.000214
H  2.804899 -2.635424 -0.000298
