program: Gaussian 09
title: 000119308
version: EM64L-G09RevD.01
frameworkgroup: C1[X(C11H11N5)]
method: RPBEPBE
basis: SDD
operation: Freq
keyword: #pfreq=noraman
keyword: PBEPBE/SDD
title: #p freq=noraman PBEPBE/SDD
converged: NO NO NO NO
title: Mulliken charges:
elementType: N N N N N C C C C C C C C C C C H H H H H H H H H H H
charge: -0.232813 -0.049295 0.041959 -0.030561 -0.627456 0.349323 -0.046978 0.000869 0.004159 -0.362318 0.122274 -0.358479 -0.663019 0.222470 -0.427057 -0.786603 0.225910 0.256653 0.242420 0.251084 0.242399 0.243196 0.345483 0.328789 0.227937 0.251693 0.227959
chargesum: 0.00000
title: Mulliken charges with hydrogens summed into heavy atoms:
elementType: N N N N N C C C C C C C C C C C
charge: -0.232813 -0.049295 0.041959 -0.030561 0.046816 0.349323 -0.046978 0.000869 0.004159 -0.136408 0.122274 -0.101826 0.072884 0.222470 -0.183861 -0.079013
polarizability: 2.75332872e+02 -3.09244453e+00 1.58376295e+02 -4.90157796e-04 4.05431633e-03 6.96725948e+01
1716.lowfreq: -55.4024 -0.0007 -0.0005 -0.0004 5.7295 9.3658 14.7948 58.2660 66.8303
frequency: -55.3180 58.2484 66.8147 90.5490 129.9066 156.6411 163.0842 192.4973 258.9953 262.6671 294.4684 309.8680 335.2428 379.9071 431.4380 435.1770 458.1141 504.1153 531.1701 563.1981 590.4442 604.2667 606.5740 650.7128 688.6872 698.3672 717.5306 796.3001 812.2225 831.3534 841.3554 905.2070 940.8253 943.4347 980.7003 992.9812 1015.8270 1045.9332 1073.6165 1119.8667 1132.3888 1166.1618 1205.9679 1230.0887 1255.0857 1288.9991 1306.9366 1332.6255 1362.3926 1389.1111 1395.5018 1416.3312 1428.8429 1457.1043 1461.6806 1466.2810 1476.3785 1483.2976 1484.8609 1528.0348 1555.6762 1583.6901 1598.0555 1640.8443 2970.7989 2979.3363 3046.2841 3056.4448 3109.6296 3113.0486 3115.9559 3129.5079 3170.5621 3577.1250 3724.2713
redmass: 1.1216 1.6348 1.5864 2.6375 2.0755 3.0877 4.0738 2.4798 4.0291 2.8601 3.1307 4.4898 4.9073 5.0038 4.3928 4.9697 1.1912 6.0404 4.8607 4.9374 4.9215 5.4559 3.3166 6.4630 8.8098 6.7779 4.1660 2.1320 5.8894 3.7553 4.4349 1.3469 2.7059 1.3303 2.9265 2.6048 2.1673 1.5833 2.5318 1.3090 1.5001 1.9585 4.6958 3.4544 2.6300 8.7325 2.5136 4.2121 3.3209 1.2724 2.6645 2.8526 3.1105 1.4731 1.7327 1.0464 1.0407 1.9069 1.5529 5.3675 2.6656 6.0327 2.8983 2.5185 1.0366 1.0380 1.1023 1.0972 1.0965 1.0978 1.0920 1.0894 1.0951 1.0450 1.1048
irintensity: 24.5423 4.9877 1.5513 0.0073 47.3207 23.2636 6.6745 29.2675 31.7513 1.2019 0.0147 7.4163 0.6712 12.2084 0.7170 12.4834 149.1384 1.7862 3.0007 0.4764 20.8011 0.0116 0.0016 3.3594 3.2777 4.2119 17.6216 30.1396 1.6113 18.4682 1.6254 9.9603 14.7131 0.7053 24.5512 11.4285 8.4555 7.4563 14.3375 0.4317 9.9401 31.9820 4.1770 12.2151 88.8872 0.1561 4.6615 70.7026 41.0118 16.3752 66.7613 15.7345 12.3882 39.8809 38.2604 15.4807 14.1750 42.1674 1.4012 55.3076 166.1755 14.5499 45.6845 575.8185 78.6786 27.0678 26.7019 20.1466 7.5162 8.5222 30.5307 12.5664 9.8318 144.5831 43.2075
temp: 298.150 k
press: 1.00000 atm
elementType: 7 7 7 7 7 6 6 6 6 6 6 6 6 6 6 6 1 1 1 1 1 1 1 1 1 1 1
symmnumber: 1
zpe: 545004.3 jmol-1
zpe.correction: 0.207581 hartree
zpe.thermalcorrener: 0.220979 hartree
zpe.thermalcorrenthalpy: 0.221923 hartree
zpe.thermalcorrgfe: 0.167616 hartree
zpe.sumelectzpe: -698.416146 hartree
zpe.sumelectthermal: -698.402749 hartree
zpe.sumelectthermalent: -698.401804 hartree
zpe.sumelectthermalfe: -698.456111 hartree
dipole: -5.8231 2.0488 0.0001
dipole: 6.1730
quadrupole: -52.1609 -92.6708 -96.5288
quadrupole: -5.7583 0.0016 0.0014
quadrupole: 28.2926 -12.2173 -16.0752 -5.7583 0.0016 0.0014
hfenergy: -698.6237276 hartree
pointgroup: C01 [X(C11H11N5)]
dipole: -2.2840788 -0.8254034 -0.0000274 debye
polarizability: 275.2721628|4.0816448|158.4370037|0.0004558|0.0040583|69.6725948 unknown
InChI: InChI=1S/C11H11N5/c1-6-5-13-9-7(14-6)3-4-8-10(9)15-11(12)16(8)2/h3-5H,12H2,1-2H3
charge 0 multiplicity 1
27 atoms
N  -2.803573 -0.42297 -0.000197
N  -1.624624 1.556837 -0.000156
N  1.440202 1.634937 -0.000039
N  2.75269 -0.927788 -0.000154
N  -4.035001 1.680328 -0.000098
C  -1.434057 -0.772232 -0.000232
C  -0.729536 0.472837 -0.000161
C  0.702461 0.462219 -0.000116
C  1.36569 -0.838632 -0.000193
C  -0.791281 -2.035199 -0.00029
C  -2.845833 0.983311 -0.00012
C  0.607967 -2.056217 -0.000276
C  -3.953626 -1.325777 -0.000517
C  3.456529 0.228165 -0.000098
C  2.781428 1.501257 -0.000038
C  4.966795 0.146959 -0.000107
H  -1.357458 -2.973556 -0.0003
H  1.166109 -2.996646 -0.000316
H  -4.578239 -1.182259 0.901814
H  -3.597982 -2.367632 -0.001359
H  -4.578654 -1.180968 -0.902353
H  3.364328 2.430747 -0.000025
H  -3.977538 2.694577 -0.000094
H  -4.941082 1.224334 0.000203
H  5.396893 0.644761 0.889554
H  5.275878 -0.909972 0.000428
H  5.396815 0.643778 -0.89036
