program: Gaussian 09
title: 000118844
version: EM64L-G09RevD.01
frameworkgroup: C1[X(C6H9N3O2)]
method: RPBEPBE
basis: SDD
operation: Freq
keyword: #pfreq=noraman
keyword: PBEPBE/SDD
title: #p freq=noraman PBEPBE/SDD
converged: NO YES NO NO
title: Mulliken charges:
elementType: O O N N N C C C C C C H H H H H H H H H
charge: -0.276456 -0.224032 -0.405805 -0.450480 -0.068245 -0.334829 -0.634711 0.310494 0.253326 -0.149409 -0.275276 0.215982 0.216058 0.286049 0.245949 0.245660 0.202361 0.316463 0.264776 0.262125
chargesum: 0.00000
title: Mulliken charges with hydrogens summed into heavy atoms:
elementType: O O N N N C C C C C C
charge: -0.276456 -0.224032 -0.119755 -0.134017 -0.068245 0.097210 0.059259 0.310494 0.253326 0.115368 -0.013151
polarizability: 1.43262593e+02 -4.93430689e+00 8.88880593e+01 -1.01261987e-02 -1.04019964e-02 4.88219448e+01
1716.lowfreq: -107.3328 -43.3079 -11.0250 -3.3593 0.0006 0.0006 0.0009 8.4446 49.6286
frequency: -107.3107 -43.2908 49.5794 85.4741 103.4157 238.9042 266.4652 283.1141 284.3897 352.5777 396.2693 436.8668 571.4524 591.5685 667.7983 694.8257 710.5852 737.1686 753.2884 798.9284 837.5929 844.6550 878.4454 911.4535 961.1426 1000.1115 1061.5378 1086.7599 1104.8364 1118.6822 1142.4111 1187.0432 1232.2538 1282.8722 1290.4720 1344.6941 1408.1050 1466.0860 1472.6065 1485.3507 1490.6472 1502.1670 1528.2402 1616.2936 1692.9503 2956.4464 2996.7127 3003.3917 3101.4590 3133.9470 3244.4010 3291.3959 3525.8258 3545.4818
redmass: 2.2446 3.8808 4.5527 3.4296 4.8670 4.6343 2.7204 6.2313 1.1814 7.8713 1.5394 3.8072 1.8395 1.6431 4.4639 10.1579 1.5062 5.3773 6.0421 1.1185 5.4811 1.3438 8.0064 5.2246 2.6530 7.8034 2.4509 3.5461 1.4529 2.1041 1.5080 2.9877 2.8844 1.6113 1.0939 1.3186 1.2047 1.0397 1.0965 1.3443 1.8266 2.6345 1.4234 9.8100 6.6021 1.0577 1.1053 1.0405 1.0952 1.1014 1.0932 1.1091 1.0765 1.0758
irintensity: 1.0074 0.7774 2.6125 3.2863 1.3444 10.8627 5.8723 0.4379 0.7616 3.5020 7.2126 5.4991 107.8230 121.5116 31.5658 41.5393 34.8146 14.1761 5.0597 1.8528 13.1537 13.5295 18.3109 12.6273 1.0839 9.0712 65.5684 49.7571 35.1195 51.3234 6.1623 28.4878 270.8349 8.9523 0.2562 171.3802 32.6726 10.8516 116.1363 140.0612 79.7401 114.4977 145.7269 359.1756 281.5276 77.9156 39.4442 39.2660 33.4163 23.8169 7.1045 0.6686 5.2283 34.0175
temp: 298.150 k
press: 1.00000 atm
elementType: 8 8 7 7 7 6 6 6 6 6 6 1 1 1 1 1 1 1 1 1
symmnumber: 1
zpe: 405349.5 jmol-1
zpe.correction: 0.154389 hartree
zpe.thermalcorrener: 0.163861 hartree
zpe.thermalcorrenthalpy: 0.164805 hartree
zpe.thermalcorrgfe: 0.118801 hartree
zpe.sumelectzpe: -547.881906 hartree
zpe.sumelectthermal: -547.872435 hartree
zpe.sumelectthermalent: -547.871490 hartree
zpe.sumelectthermalfe: -547.917495 hartree
dipole: 1.0194 -5.2169 -0.0003
dipole: 5.3156
quadrupole: -45.9949 -64.2083 -66.5759
quadrupole: -5.5394 -0.0055 0.0036
quadrupole: 12.9315 -5.2819 -7.6496 -5.5394 -0.0055 0.0036
hfenergy: -548.0362955 hartree
pointgroup: C01 [X(C6H9N3O2)]
dipole: 0.4408165 -2.0443131 0.0010406 debye
dipolederiv: -0.5667149 0.1141482 -0.0001467 -0.2354359 -0.7039946 0.0008775 0.0002463 0.0008471 -0.1196014 -0.7501845 -0.0525606 0.0001429 -0.1929133 -0.9208981 -0.0000483 0.0006122 0.0004558 -0.3191389 -1.4298711 0.3166762 0.0002598 0.4838911 -0.4967607 0.000175 -0.0000636 0.0002122 -0.5216049 -2.270596 0.0585453 0.0001515 -0.1494125 -0.3957584 -0.0000913 0.0000802 -0.0000818 -0.3723867 -0.614567 0.095357 -0.0000779 0.5446519 -0.4938541 0.0003571 -0.0007219 0.0004034 -0.2229677 0.8649517 -0.0306399 -0.0003448 0.1650313 0.1300255 -0.0002214 -0.0002338 -0.0001646 0.367337 0.0191519 -0.0428531 -0.0000596 -0.043161 -0.072882 -0.0000178 -0.0000471 -0.000027 0.0440295 2.6964936 -0.1303058 -0.0007214 0.3112968 1.3966542 -0.0000523 -0.0017101 -0.0003413 0.3131014 1.7693039 -0.2476539 0.0002732 -0.6706174 0.7103882 -0.0007754 0.0007396 -0.0008153 0.1949072 -0.1065805 -0.1453994 0.000211 -0.0983297 0.2331143 -0.0005901 0.0001509 -0.0005771 -0.1850163 0.3507239 -0.0402869 0.00001 -0.0981464 0.1308586 -0.0003943 0.0001257 -0.000376 -0.1488021 -0.1281445 0.0422967 -0.0545943 0.0229425 -0.00259 0.1029082 -0.1250466 0.1252157 -0.0854231 -0.1281371 0.0419955 0.0546483 0.0222651 -0.0018895 -0.1027232 0.1253735 -0.1250051 -0.0864167 0.0743462 -0.0696022 0.0000349 -0.0907623 0.0639604 -0.0001107 0.0003268 -0.0002782 0.3466157 0.1247461 0.0521648 -0.0694492 0.0103207 0.0310821 0.0640629 -0.068424 0.0657128 -0.0477114 0.1244656 0.0517929 0.0695947 0.0100178 0.031324 -0.0639294 0.0683508 -0.0656969 -0.0486709 -0.2395537 -0.0470612 0.000103 -0.0029304 0.0815323 -0.0000802 0.0001358 -0.0000952 0.1103364 0.1195134 0.0008879 -0.0000111 -0.0388344 0.1395354 0.0002239 0.0001576 0.0001977 0.3406983 0.0494643 -0.0180549 0.0000428 -0.0568158 0.0872184 0.0002315 0.0001024 0.0002221 0.2460283 0.0411886 0.0505536 -0.0000671 0.1069418 0.052934 0.0001984 -0.0001547 0.0001917 0.1946861 unknown
polarizability: 143.4336518|-3.8751664|88.7169758|-0.0073076|-0.0331642|48.8219694 unknown
InChI: InChI=1S/C6H9N3O2/c1-2-7-5(10)9-6-8-3-4-11-6/h3-4,7,9H,2H2,1H3
charge 0 multiplicity 1
20 atoms
O  -2.424496 -1.161794 0.001528
O  1.17298 1.245237 -0.000964
N  2.196939 -0.889309 -0.000425
N  -0.125507 -0.727955 0.000757
N  -1.843578 1.073089 -0.00172
C  3.644811 -0.560613 -0.001221
C  4.012084 0.934157 0.00105
C  1.117728 -0.007077 0.000064
C  -1.394086 -0.171098 0.000045
C  -3.622751 -0.389235 0.000516
C  -3.260461 0.938862 -0.001464
H  4.100624 -1.040253 0.889419
H  4.099235 -1.037317 -0.894153
H  1.996925 -1.891563 -0.000912
H  3.620507 1.456341 -0.884827
H  3.621641 1.453326 0.889225
H  5.115763 1.008041 0.000514
H  -0.12399 -1.749926 0.002075
H  -4.551219 -0.948691 0.0014
H  -3.894351 1.821276 -0.002708
