program: Gaussian 09
title: 000118794
version: EM64L-G09RevD.01
frameworkgroup: C1[X(C5H8O2)]
method: RPBEPBE
basis: SDD
operation: Freq
keyword: #p
keyword: freq=noraman
keyword: PBEPBE/SDD
title: #p freq=noraman PBEPBE/SDD
converged: NO YES NO YES
title: Mulliken charges:
elementType: O O C C C C C H H H H H H H H
charge: -0.277330 -0.250025 0.358459 -0.751088 0.157370 -0.629659 -0.503506 0.240665 0.240669 0.214368 0.228954 0.254706 0.231695 0.242361 0.242360
chargesum: 0.00000
title: Mulliken charges with hydrogens summed into heavy atoms:
elementType: O O C C C C C
charge: -0.277330 -0.250025 0.358459 -0.055386 0.157370 -0.145999 0.212911
polarizability: 8.13026938e+01 9.07131435e+00 6.54408610e+01 8.44702821e-04 5.10962415e-03 3.60571013e+01
1716.lowfreq: -14.0235 -13.0116 -7.5194 -0.0005 0.0007 0.0008 58.9694 75.8251 152.6380
frequency: 58.7280 75.6768 152.6350 169.8073 194.5765 316.0621 365.2035 394.6098 471.0859 572.6780 633.4417 766.5228 784.4112 921.5169 967.0063 989.4497 1007.7358 1053.1860 1113.7955 1122.3339 1147.8863 1293.7961 1395.3071 1414.7412 1422.0867 1449.6120 1455.1891 1463.4525 1471.4692 1612.9282 1654.6190 2990.3496 3003.3225 3074.3750 3098.1404 3103.5247 3104.4946 3147.8543 3216.8110
redmass: 1.6854 1.6458 2.5955 1.1519 3.0885 3.9686 2.7356 3.5989 4.6670 3.6620 1.5401 5.4547 2.0703 2.9113 3.0747 1.3174 1.3936 1.5049 1.2681 4.3085 1.5122 3.8180 1.1700 1.2529 1.1826 1.0500 1.0449 1.0508 1.0609 9.8144 5.1876 1.0360 1.0296 1.0970 1.1009 1.1042 1.0619 1.1046 1.1156
irintensity: 0.6542 1.5600 6.0484 3.5487 4.0765 12.8084 2.7238 0.0860 5.2103 2.8480 11.3651 9.9367 9.5301 4.7351 5.8628 61.3008 13.4238 7.0600 0.0320 273.3279 50.6807 81.7218 23.1234 5.9411 21.3629 14.7282 13.7675 17.4790 31.4858 143.5289 2.4881 17.1742 33.3152 16.3996 24.2276 27.6365 4.8741 17.2714 5.5629
temp: 298.150 k
press: 1.00000 atm
elementType: 8 8 6 6 6 6 6 1 1 1 1 1 1 1 1
symmnumber: 1
zpe: 314919.5 jmol-1
zpe.correction: 0.119946 hartree
zpe.thermalcorrener: 0.128316 hartree
zpe.thermalcorrenthalpy: 0.129260 hartree
zpe.thermalcorrgfe: 0.086771 hartree
zpe.sumelectzpe: -345.205796 hartree
zpe.sumelectthermal: -345.197426 hartree
zpe.sumelectthermalent: -345.196482 hartree
zpe.sumelectthermalfe: -345.238971 hartree
dipole: -0.0135 1.9188 0.0002
dipole: 1.9189
quadrupole: -32.1356 -45.9827 -42.6814
quadrupole: 2.1258 -0.0001 -0.0005
quadrupole: 8.1310 -5.7162 -2.4148 2.1258 -0.0001 -0.0005
hfenergy: -345.3257422 hartree
pointgroup: C01 [X(C5H8O2)]
dipole: -0.0031221 -0.754944 0.0000602 debye
dipolederiv: -1.2110473 -0.3664739 -0.0000157 -0.4852526 -0.7628927 0.0000521 -0.0000793 -0.0000169 -0.2924039 -0.6855324 0.2165151 -0.0000048 0.0584702 -0.8989513 -0.0000208 -0.0000312 0.000182 -0.3264851 -0.4189804 -0.0676966 0.0000104 -0.094894 0.3187196 -0.0000646 0.0000828 -0.000061 -0.0450685 0.0244163 -0.0121385 0.0000044 -0.0083227 -0.1799786 0.0000387 0.000014 0.0000245 0.0730479 1.5843881 0.2208363 -0.0000256 0.3680035 1.2072515 -0.0000016 -0.0000354 -0.0001525 0.2320634 0.0290555 -0.1053934 -0.0000262 0.0776293 -0.115486 -0.0000382 0.0000054 -0.0000265 -0.3385855 0.6593108 0.0925663 0.0000359 0.0142 0.221877 -0.0000004 0.0000506 0.0000212 0.2813534 0.0943844 -0.0296024 0.0911113 -0.030995 0.028317 0.0572337 0.0679855 0.0915099 -0.0339271 0.0943768 -0.0296348 -0.0910954 -0.0310121 0.0282689 -0.0572511 -0.0679775 -0.0915241 -0.0338755 -0.1630275 0.0946968 -0.0000179 0.0058116 0.0574668 0.0000111 0.0000073 0.0000149 0.1109458 -0.0801719 0.0438669 0.0000091 0.0704917 0.0795958 0.0000059 -0.0000221 0.0000138 0.1713502 0.1107359 0.0459215 -0.0000015 0.0281425 -0.0291983 0.0000386 0.0000064 0.0000346 0.1967243 0.0057715 -0.0712536 -0.0000043 -0.1266604 -0.0660089 0.0000054 -0.0000043 0.0000088 0.1198055 -0.0218314 -0.0161183 -0.0064417 0.0771699 0.0555276 0.1016197 -0.057893 0.0767313 -0.0574998 -0.0218485 -0.0160914 0.006462 0.0772181 0.0554916 -0.1016285 0.0578909 -0.07676 -0.0574452 unknown
polarizability: 81.5034702|8.89178|65.2400846|-0.0009018|-0.0050999|36.0571013 unknown
InChI: InChI=1S/C5H8O2/c1-4(2)5(6)7-3/h1H2,2-3H3
charge 0 multiplicity 1
15 atoms
O  -1.160085 -0.721441 -0.00016
O  -0.660693 1.553586 -0.000475
C  1.156017 -0.114669 -0.000166
C  1.431214 -1.603799 0.000071
C  -0.267767 0.36016 -0.000115
C  2.127385 0.839786 -0.000421
C  -2.59517 -0.358354 -0.000404
H  0.981305 -2.089228 0.884526
H  0.981307 -2.089505 -0.884235
H  2.516562 -1.800728 0.0001
H  3.189496 0.572493 -0.000449
H  1.862269 1.90264 -0.00059
H  -3.129284 -1.318754 -0.000377
H  -2.839753 0.234609 -0.897942
H  -2.840002 0.234803 0.896938
