program: Gaussian 09
title: 000119598
version: EM64L-G09RevD.01
frameworkgroup: C1[X(C12H15N3O4)]
method: RPBEPBE
basis: SDD
operation: Freq
keyword: #p
keyword: freq=noraman
keyword: PBEPBE/SDD
title: #p freq=noraman PBEPBE/SDD
converged: YES YES NO NO
title: Mulliken charges:
elementType: O O O O N N N C C C C C C C C C C C C H H H H H H H H H H H H H H H
charge: -0.274409 -0.222725 -0.256526 -0.237385 -0.090167 0.069087 0.005333 -0.401180 -0.382544 -0.520693 0.143674 -0.272825 0.294518 -0.271509 -0.448782 -0.203365 -0.326581 0.318292 -0.745410 0.224737 0.239577 0.263662 0.242500 0.263490 0.242907 0.276386 0.262831 0.261715 0.293109 0.239260 0.251246 0.262751 0.246356 0.252668
chargesum: 0.00000
title: Mulliken charges with hydrogens summed into heavy atoms:
elementType: O O O O N N N C C C C C C C C C C C C
charge: -0.274409 -0.222725 -0.256526 -0.237385 -0.090167 0.069087 0.005333 0.063134 0.123618 -0.014296 0.143674 0.266392 0.294518 -0.009794 -0.155673 0.035895 -0.075335 0.318292 0.016364
polarizability: 1.88313108e+02 -2.89353251e+01 1.38628813e+02 -1.48272342e+00 1.03220512e+00 1.50760310e+02
1716.lowfreq: -7.4363 -6.4221 -0.0005 0.0007 0.0007 5.0069 15.1021 24.4799 28.8498
frequency: 14.0372 23.9941 28.8374 38.7309 48.6316 53.5440 83.4462 98.0066 115.4615 142.0172 169.1548 170.3532 180.7102 219.2929 250.9441 298.2865 318.0621 347.9484 358.1813 369.2029 384.7632 410.5480 460.7743 483.3395 492.2129 562.3170 568.0812 597.8170 609.0489 616.5929 672.3289 716.1072 746.2338 798.7975 813.9114 826.7133 854.3589 865.8350 892.3028 928.0472 940.2025 965.1822 969.1503 986.1074 993.2651 1004.5710 1010.4853 1023.1845 1032.3188 1041.6389 1088.9200 1116.1220 1127.2675 1172.3993 1185.7781 1195.5385 1201.2709 1224.7405 1257.9807 1286.4471 1299.0719 1308.6379 1324.0514 1343.0909 1352.7469 1358.9675 1363.3551 1383.7458 1389.9719 1408.9697 1432.7645 1442.3143 1450.3413 1452.1948 1453.7395 1456.3100 1476.9685 1543.6293 1578.1044 1598.3305 1651.8019 2976.4931 3006.8490 3009.3625 3018.8779 3031.4687 3036.3998 3074.6330 3101.1610 3102.9355 3110.6040 3136.4247 3140.8939 3150.4512 3152.0322 3172.1650
redmass: 5.1433 8.0171 8.2703 4.5041 5.2255 6.1669 1.0442 5.1666 5.6246 4.6443 4.9800 4.3587 3.8684 3.4157 4.0095 4.2493 5.4140 2.9002 2.7635 2.8474 2.5730 3.8849 6.4043 3.1493 5.0861 3.1684 2.7011 4.7572 6.9974 4.3742 5.1607 1.9403 3.3703 1.9910 2.7837 2.5513 3.4737 5.9777 2.9395 4.7382 1.3677 2.6947 1.8899 1.9783 1.4673 1.8519 3.9219 2.2901 2.6287 1.6517 1.8628 2.0740 1.8515 2.0280 1.4854 1.5125 1.2967 2.4052 2.0286 1.3080 1.7471 8.5913 1.3132 1.4549 1.4794 1.3886 1.4824 1.4441 2.2662 2.2092 1.1282 1.1058 1.0645 1.3937 1.4243 1.0616 1.0866 5.3414 5.7562 8.0708 9.8548 1.0614 1.0386 1.0634 1.0675 1.0905 1.0552 1.1024 1.0936 1.1007 1.1090 1.0881 1.1024 1.0910 1.0926 1.1002
irintensity: 0.7095 2.1303 1.0529 4.8682 1.9175 2.0084 1.4367 3.3786 0.7109 6.0128 1.9909 7.0666 1.0755 8.0214 1.6422 7.3095 2.3102 3.8437 1.2298 3.0528 3.2015 0.9898 9.3832 4.0835 5.6417 2.0895 0.4651 1.5175 0.5694 1.7297 13.1107 36.2449 13.3579 49.5743 15.7317 11.7526 36.9501 172.7578 40.0540 66.2905 1.7424 21.8974 20.4502 88.1201 2.5763 8.2700 2.0432 14.2425 10.2986 16.2438 54.8343 20.4891 5.4826 131.2852 74.6362 82.4596 31.5782 106.4216 52.1491 18.6168 50.8590 2.3670 1.7772 48.7509 28.5464 3.8969 19.7104 19.5046 46.5395 21.4915 18.5120 19.3003 38.9662 15.6670 3.7451 25.0119 26.3859 46.3172 49.5129 61.9601 225.7796 28.1532 0.7313 9.7737 31.1334 18.2097 12.5834 12.0018 6.3142 9.4331 1.4626 5.3077 8.6711 13.9711 0.7875 15.6019
temp: 298.150 k
press: 1.00000 atm
elementType: 8 8 8 8 7 7 7 6 6 6 6 6 6 6 6 6 6 6 6 1 1 1 1 1 1 1 1 1 1 1 1 1 1 1
symmnumber: 1
zpe: 686306.0 jmol-1
zpe.correction: 0.261400 hartree
zpe.thermalcorrener: 0.280669 hartree
zpe.thermalcorrenthalpy: 0.281613 hartree
zpe.thermalcorrgfe: 0.209725 hartree
zpe.sumelectzpe: -929.931376 hartree
zpe.sumelectthermal: -929.912107 hartree
zpe.sumelectthermalent: -929.911163 hartree
zpe.sumelectthermalfe: -929.983050 hartree
dipole: -2.4413 -2.0119 2.0307
dipole: 3.7592
quadrupole: -122.8668 -114.8517 -114.9322
quadrupole: -6.7610 -22.9621 2.2023
quadrupole: -5.3166 2.6985 2.6180 -6.7610 -22.9621 2.2023
hfenergy: -930.1927758 hartree
pointgroup: C01[X(C12H15N3O4)]
dipole: 1.0694758 0.8152753 0.6155871 debye
polarizability: 182.407836|-32.6794633|144.9294968|5.5912733|1.4628361|150.3648973 unknown
InChI: InChI=1S/C12H15N3O4/c1-10(16)19-9-15(14-18)7-3-5-12(17)11-4-2-6-13-8-11/h2,4,6,8H,3,5,7,9H2,1H3
charge 0 multiplicity 1
34 atoms
O  -1.373187 -1.178962 0.232062
O  0.533806 1.074398 -2.212489
O  -3.970814 0.527205 1.828214
O  -1.843237 -3.370064 -0.405294
N  -2.90387 0.610779 -0.167725
N  -3.546348 1.279826 0.882932
N  4.021327 -0.800904 -0.822386
C  -1.386959 2.556729 -0.743993
C  -2.391017 1.493722 -1.247419
C  -0.143866 1.974231 -0.045983
C  0.78421 1.192406 -0.976248
C  -2.771462 -0.827132 -0.203135
C  2.017565 0.559848 -0.391657
C  2.362745 0.647832 0.982707
C  2.887647 -0.174544 -1.246431
C  3.536552 0.011448 1.438533
C  4.32962 -0.699971 0.50799
C  -1.035407 -2.537172 0.06007
C  0.39209 -2.799478 0.481137
H  -1.07525 3.147728 -1.624928
H  -1.907497 3.236191 -0.046164
H  -1.902916 0.84974 -1.995168
H  -3.248294 1.998721 -1.729278
H  -0.447961 1.30709 0.784844
H  0.438616 2.796247 0.418313
H  -3.482902 -1.273521 0.511698
H  -2.929449 -1.22375 -1.219038
H  1.730314 1.197397 1.686882
H  2.649224 -0.253453 -2.312415
H  3.835019 0.060484 2.49016
H  5.246491 -1.210615 0.823504
H  1.067462 -2.628151 -0.377214
H  0.699129 -2.124974 1.294842
H  0.493119 -3.850333 0.791778
