program: Gaussian 09
title: 000119276
version: EM64L-G09RevD.01
frameworkgroup: C1[X(C16H15NO2)]
method: RPBEPBE
basis: SDD
operation: Freq
keyword: #p
keyword: freq=noraman
keyword: PBEPBE/SDD
title: #p freq=noraman PBEPBE/SDD
converged: YES YES NO NO
title: Mulliken charges:
elementType: O O N C C C C C C C C C C C C C C C C H H H H H H H H H H H H H H H
charge: -0.371529 -0.257994 -0.215003 -0.696529 0.324575 0.181908 0.274845 0.186436 -0.571861 -0.379487 0.433570 -0.422099 -0.396901 -0.453152 -0.237674 -0.234354 0.213530 -0.472614 -0.667961 0.250314 0.246465 0.313576 0.239795 0.241439 0.237090 0.271589 0.225093 0.224856 0.255175 0.219581 0.227355 0.211261 0.233611 0.365094
chargesum: 0.00000
title: Mulliken charges with hydrogens summed into heavy atoms:
elementType: O O N C C C C C C C C C C C C C C C C
charge: -0.006434 -0.257994 -0.215003 -0.199750 0.324575 0.181908 0.274845 0.186436 -0.258285 -0.139692 0.433570 -0.180660 -0.159811 -0.181563 -0.012581 -0.009498 0.213530 0.002141 0.004266
polarizability: 3.39692917e+02 -3.51787976e+00 1.88719587e+02 -2.90798555e+00 -2.70752262e+00 8.97389708e+01
1716.lowfreq: -8.9838 -4.3143 -0.0006 -0.0002 0.0006 1.3369 26.2916 39.2469 55.8551
frequency: 26.2637 39.2122 55.8301 81.6590 96.2590 135.6194 157.0652 179.7578 189.8076 232.1819 237.4887 247.3409 283.4364 301.5459 333.6272 357.5272 365.8276 422.2909 434.3028 471.4413 499.4255 505.0147 535.9346 544.7401 566.5088 593.2258 620.2012 648.9660 687.9188 705.9141 739.3292 741.2261 776.5149 792.4852 803.3376 826.2882 841.1220 868.1273 894.8308 908.6189 938.9222 960.8993 971.2203 984.7909 992.9216 1005.5991 1024.5927 1028.0414 1076.1478 1076.9253 1097.2294 1126.3964 1131.5799 1143.4486 1168.1873 1182.0105 1190.3173 1203.5680 1234.2406 1242.8982 1283.3525 1298.0118 1307.9215 1321.6068 1350.7237 1378.3175 1392.2593 1396.4075 1425.9719 1435.0210 1442.8942 1444.9123 1463.5777 1467.5206 1478.9420 1483.1412 1583.1216 1590.1418 1595.0435 1620.8648 1623.8915 2984.6183 2991.6980 2999.5497 3028.9026 3041.5676 3095.2455 3104.4887 3120.4161 3127.3777 3135.6175 3141.2993 3160.3084 3179.6891 3194.5701 3432.6592
redmass: 4.0378 6.0661 2.8594 2.4878 4.0147 3.7114 4.8333 4.6410 1.2393 5.0098 2.1368 4.9440 1.2419 3.5844 6.2159 4.4670 6.2830 2.7357 2.8649 6.3586 4.2240 3.3499 2.7293 6.1086 6.4860 3.4178 6.1111 5.9200 5.0926 3.1367 2.1318 3.1615 2.0643 1.3527 4.4606 5.2404 1.4754 1.3818 1.4808 3.8354 1.4796 1.4038 1.7964 1.3384 5.8628 2.0831 2.1356 3.0855 1.6976 2.3606 2.1026 1.9835 1.1509 1.7067 1.1485 1.6847 2.1283 1.9124 1.7877 1.1756 2.4280 1.5377 2.0644 1.3567 2.4225 6.7184 3.4153 1.2239 1.1703 1.1080 3.0428 3.1641 2.8348 1.0394 1.0553 3.5394 7.5000 6.7050 8.0492 7.3551 7.4530 1.0609 1.0601 1.0387 1.0993 1.0972 1.1000 1.1001 1.0853 1.0895 1.0903 1.0946 1.1003 1.0935 1.0931 1.0682
irintensity: 0.2611 5.9099 0.1108 1.5720 1.0160 1.5559 5.1278 1.5651 0.8218 0.5469 14.5818 18.2436 101.3182 11.9001 47.8782 4.6807 2.5745 12.1232 0.5216 7.2339 0.8531 0.8492 1.4989 0.1758 2.8101 1.2135 1.7610 3.8444 2.9266 0.0841 36.9226 16.4233 55.6528 14.5952 5.7533 6.2068 34.1371 0.0248 9.1874 10.9063 3.1912 5.4069 12.8861 0.4703 4.2115 0.2493 5.9658 20.7335 3.7748 5.3076 1.3810 2.4731 0.1281 45.7162 0.3096 71.6831 36.4327 15.2784 57.7977 0.5026 123.0876 25.9513 29.2567 27.5774 204.5640 59.2015 7.5704 28.4596 14.2914 27.1612 14.0219 92.8209 36.1057 12.0271 21.5605 26.5475 11.0720 6.6530 126.3503 0.0838 19.4069 11.1625 22.7787 29.6857 6.8238 6.8089 33.3067 32.7192 4.2122 4.0315 6.2895 35.6295 43.5793 3.5928 3.2450 6.6826
temp: 298.150 k
press: 1.00000 atm
elementType: 8 8 7 6 6 6 6 6 6 6 6 6 6 6 6 6 6 6 6 1 1 1 1 1 1 1 1 1 1 1 1 1 1 1
symmnumber: 1
zpe: 703702.1 jmol-1
zpe.correction: 0.268026 hartree
zpe.thermalcorrener: 0.284794 hartree
zpe.thermalcorrenthalpy: 0.285738 hartree
zpe.thermalcorrgfe: 0.222829 hartree
zpe.sumelectzpe: -822.538414 hartree
zpe.sumelectthermal: -822.521646 hartree
zpe.sumelectthermalent: -822.520702 hartree
zpe.sumelectthermalfe: -822.583611 hartree
dipole: -0.3241 2.0824 2.0164
dipole: 2.9168
quadrupole: -96.5701 -103.3464 -112.9262
quadrupole: -9.2005 -6.8317 1.2478
quadrupole: 7.7108 0.9345 -8.6453 -9.2005 -6.8317 1.2478
hfenergy: -822.8064405 hartree
pointgroup: C01 [X(C16H15N1O2)]
dipole: 0.1405434 0.8264901 -0.7835902 debye
polarizability: 339.7708022|1.3348315|188.571807|-2.5145652|3.8988312|89.808865 unknown
InChI: InChI=1S/C16H15NO2/c1-2-16(18)17(19)13-7-8-15-12(10-13)9-11-5-3-4-6-14(11)15/h3-8,10,19H,2,9H2,1H3
charge 0 multiplicity 1
34 atoms
O  3.5533 1.849386 -0.243376
O  3.427345 -1.708603 0.250176
N  2.941598 0.530876 -0.152778
C  -1.642213 -1.753766 -0.229619
C  -0.633282 -0.61465 -0.132844
C  -1.317681 0.627719 0.031583
C  -2.98169 -1.033727 -0.112832
C  -2.768958 0.371612 0.042417
C  0.765509 -0.684178 -0.186537
C  -0.575091 1.821143 0.155679
C  1.506906 0.528418 -0.065556
C  -4.284935 -1.559259 -0.139579
C  -3.866215 1.252525 0.172095
C  0.833465 1.770791 0.110015
C  -5.385835 -0.674591 -0.009514
C  -5.175736 0.718778 0.145022
C  3.847628 -0.531727 0.049613
C  5.331485 -0.16193 -0.003273
C  6.230146 -1.394926 0.196187
H  -1.498853 -2.496051 0.579978
H  -1.550079 -2.308281 -1.183967
H  1.292454 -1.632797 -0.29476
H  -1.074998 2.785646 0.297492
H  -4.45447 -2.635824 -0.258039
H  -3.712244 2.331089 0.291539
H  1.420816 2.682787 0.239754
H  -6.407741 -1.069769 -0.027709
H  -6.038243 1.387539 0.244374
H  5.533314 0.608404 0.764606
H  5.550082 0.330114 -0.971352
H  6.053881 -2.148971 -0.589643
H  7.293697 -1.097707 0.168645
H  6.025395 -1.880591 1.165126
H  3.432743 2.12712 -1.196123
