program: Gaussian 09
title: 000119278
version: EM64L-G09RevD.01
frameworkgroup: C1[X(C12H15NO3)]
method: RPBEPBE
basis: SDD
operation: Freq
keyword: #p
keyword: freq=noraman
keyword: PBEPBE/SDD
title: #p freq=noraman PBEPBE/SDD
converged: YES YES NO NO
title: Mulliken charges:
elementType: O O O N C C C C C C C C C C C C H H H H H H H H H H H H H H H
charge: -0.347519 -0.220980 -0.265958 -0.369327 -0.641080 0.343921 0.246073 0.196256 -0.492789 -0.353239 -0.337472 -0.239280 -0.680011 -0.222664 0.271395 -0.602781 0.227204 0.253822 0.220377 0.297722 0.272477 0.245398 0.230621 0.226950 0.226796 0.210369 0.231656 0.335218 0.233292 0.271711 0.231843
chargesum: 0.00000
title: Mulliken charges with hydrogens summed into heavy atoms:
elementType: O O O N C C C C C C C C C C C C
charge: -0.347519 -0.220980 -0.265958 -0.034109 -0.160053 0.343921 0.246073 0.196256 0.025309 -0.080762 -0.092074 -0.008659 -0.015897 0.008992 0.271395 0.134065
polarizability: 1.73217079e+02 8.27166618e+00 1.56533460e+02 4.98926651e+00 1.29227461e+01 1.01044234e+02
1716.lowfreq: -8.9036 -6.5868 -0.0008 -0.0008 0.0003 6.0569 22.2454 32.9754 40.8783
frequency: 21.5674 32.8660 40.8781 70.2800 78.7103 91.2538 111.3449 113.5666 155.2236 166.1437 192.0641 211.7777 244.7435 262.7031 294.2786 351.0389 383.7460 422.8543 451.4265 486.0903 505.3076 577.1184 594.1201 604.5305 616.0994 650.8157 688.1474 724.3732 743.9725 765.7947 778.6757 810.9629 831.1457 873.9829 888.9297 920.6345 956.4211 990.3144 1004.1601 1030.8496 1048.7671 1067.9344 1073.6826 1084.6807 1117.3323 1127.5098 1145.9268 1157.2569 1169.6642 1192.4923 1204.8473 1219.8519 1235.3350 1269.1337 1290.3875 1351.3226 1381.9828 1392.3497 1432.1379 1433.6902 1435.7058 1459.3056 1460.3308 1469.5408 1478.5631 1479.7367 1483.4930 1515.7687 1587.3717 1610.0261 1627.1595 1694.4805 2953.7784 2982.7318 2995.2865 3005.3517 3011.3472 3061.7260 3086.8887 3092.2075 3095.9783 3115.2099 3131.6717 3142.6131 3155.9002 3170.7630 3572.8790
redmass: 4.6266 4.4203 4.5424 3.4543 4.0429 2.4927 1.8273 1.5722 3.3501 2.6148 1.4475 4.7328 3.3937 4.8719 4.7830 4.9449 2.8806 3.5717 3.1976 3.6730 4.2105 3.9705 1.1111 4.1750 3.8385 5.1142 11.4932 2.7467 2.7490 2.1281 1.9744 2.7099 2.2451 1.6535 3.2273 2.1984 1.3862 1.3295 1.8861 2.1344 1.9220 2.1155 3.1275 3.0170 1.9580 1.2836 1.6958 1.9461 1.1663 1.7932 1.6014 2.6140 1.3233 1.4292 1.3732 1.8125 7.6308 1.2123 1.1797 1.4557 1.4741 1.1708 1.3157 1.0401 1.0706 2.1616 1.0436 1.3975 6.7488 6.7694 7.6126 9.3484 1.0640 1.0354 1.0358 1.0926 1.0622 1.1027 1.1001 1.1002 1.0998 1.0985 1.0858 1.0902 1.0948 1.1006 1.0772
irintensity: 2.6955 0.4793 1.6887 0.7787 5.8360 9.0775 2.4281 1.2761 2.6534 1.1275 0.5936 1.2382 7.6142 0.6071 4.7477 17.9657 6.8586 1.9980 6.0793 0.5090 1.6482 2.4182 126.3512 3.1589 8.5537 2.7964 23.5497 13.4009 0.6616 8.6877 49.9327 14.3280 9.2359 9.0920 48.3917 9.2123 2.4129 0.4071 11.9236 4.9672 13.6126 12.3919 74.2790 155.2816 117.6293 1.5554 92.5665 129.2931 20.0374 58.1626 76.7734 3.9533 15.7163 11.8431 14.2281 42.5754 1.2700 19.6155 36.4852 4.4852 69.9145 46.7981 139.5069 11.7880 18.4973 33.1492 14.4160 121.7851 0.7051 19.5398 100.9587 314.1780 13.7265 75.8938 30.8051 7.2694 14.7035 32.9293 7.8858 31.8538 27.0287 4.1588 0.7616 5.3744 16.8686 18.5653 46.3344
temp: 298.150 k
press: 1.00000 atm
elementType: 8 8 8 7 6 6 6 6 6 6 6 6 6 6 6 6 1 1 1 1 1 1 1 1 1 1 1 1 1 1 1
symmnumber: 1
zpe: 652030.7 jmol-1
zpe.correction: 0.248345 hartree
zpe.thermalcorrener: 0.265120 hartree
zpe.thermalcorrenthalpy: 0.266064 hartree
zpe.thermalcorrgfe: 0.201688 hartree
zpe.sumelectzpe: -745.516782 hartree
zpe.sumelectthermal: -745.500007 hartree
zpe.sumelectthermalent: -745.499063 hartree
zpe.sumelectthermalfe: -745.563440 hartree
dipole: -5.0458 0.8730 -1.1396
dipole: 5.2460
quadrupole: -84.6576 -88.3649 -96.2016
quadrupole: 8.9674 6.8782 4.1554
quadrupole: 5.0838 1.3765 -6.4602 8.9674 6.8782 4.1554
hfenergy: -745.7651271 hartree
pointgroup: C01 [X(C12H15N1O3)]
dipole: 0.4601208 1.9206971 0.5992144 debye
polarizability: 163.1134329|10.632274|164.0711423|19.0007104|3.8006351|103.6101972 unknown
InChI: InChI=1S/C12H15NO3/c1-3-10(14)8-9-6-4-5-7-11(9)16-12(15)13-2/h4-7,13H,3,8H2,1-2H3
charge 0 multiplicity 1
31 atoms
O  -0.138056 1.680179 0.919932
O  0.465267 -3.516414 0.63114
O  1.478907 1.295172 -0.781797
N  1.749322 2.93356 0.887597
C  0.167794 -1.231224 1.418132
C  -0.969236 -0.630505 0.592895
C  0.90353 -2.334102 0.625252
C  -1.071789 0.75877 0.337406
C  2.139858 -1.914292 -0.157137
C  -1.98701 -1.467018 0.062329
C  -2.135055 1.308416 -0.406465
C  -3.05672 -0.934871 -0.687654
C  2.707955 -3.014864 -1.067853
C  -3.134373 0.45784 -0.923867
C  1.091178 1.923543 0.231634
C  3.063542 3.418845 0.45717
H  0.870113 -0.4409 1.729596
H  -0.251374 -1.706077 2.324621
H  2.900261 -1.587701 0.586162
H  1.8924 -0.992444 -0.722626
H  -1.92098 -2.545909 0.243127
H  -2.169277 2.390834 -0.565855
H  -3.827883 -1.603378 -1.08518
H  2.958343 -3.92107 -0.489845
H  1.968553 -3.31004 -1.832594
H  3.61781 -2.65948 -1.583409
H  -3.963384 0.878431 -1.502781
H  1.279413 3.351831 1.691124
H  3.027507 4.493497 0.201177
H  3.358476 2.852957 -0.440519
H  3.82661 3.26231 1.24179
