program: Gaussian 09
title: 000118798
version: EM64L-G09RevD.01
frameworkgroup: C1[X(C11H18NO)]
method: RPBEPBE
basis: SDD
operation: Freq
keyword: #p
keyword: freq=noraman
keyword: PBEPBE/SDD
title: #p freq=noraman PBEPBE/SDD
converged: YES YES NO NO
title: Mulliken charges:
elementType: O N C C C C C C C C C C C H H H H H H H H H H H H H H H H H H
charge: -0.372200 -0.179251 -0.407945 -0.343367 0.388643 0.378616 -0.333876 -0.469689 -0.412617 0.380714 -0.772355 -0.773029 -0.678795 0.257975 0.256673 0.213114 0.210637 0.206490 0.205611 0.266218 0.295894 0.266362 0.271369 0.264564 0.270996 0.269245 0.263816 0.242930 0.217114 0.217929 0.398216
chargesum: 1.00000
title: Mulliken charges with hydrogens summed into heavy atoms:
elementType: O N C C C C C C C C C C C
charge: 0.026015 -0.179251 0.106703 0.080384 0.388643 0.378616 0.078225 -0.203471 -0.116723 0.380714 0.029940 0.031027 -0.000822
polarizability: 1.70709677e+02 -1.97740291e+00 1.32196094e+02 -1.44600454e+01 5.00293968e-01 8.53459572e+01
1716.lowfreq: -17.1295 -10.5084 -10.0409 0.0006 0.0006 0.0007 41.0505 44.6390 50.9435
frequency: 41.0339 44.6194 50.0337 139.5034 149.5054 182.1140 191.3751 212.7365 217.7235 226.7965 234.9707 310.1648 311.0361 347.7251 405.4309 432.0701 478.7188 503.3220 509.7314 536.2207 557.8920 577.0775 600.8254 713.2380 735.5437 758.3865 790.3586 856.3410 886.1140 904.3796 908.2376 956.4322 970.2047 1007.6734 1032.4846 1033.9493 1046.7666 1048.9075 1063.0707 1109.6118 1120.6333 1142.7388 1154.9694 1192.6282 1206.3455 1258.3938 1263.1973 1282.1903 1289.4348 1329.1706 1343.5042 1353.9812 1362.0329 1396.0690 1410.2943 1412.1358 1432.1291 1456.2891 1465.6715 1472.1979 1473.2483 1478.0316 1478.5233 1480.1658 1491.0342 1507.3920 1519.4358 1572.3486 1652.7837 2974.3268 2985.8665 2991.5471 2997.0848 2997.5811 3017.9834 3048.8792 3064.2235 3081.4831 3081.9460 3082.5375 3093.8055 3119.5961 3123.6799 3125.9606 3168.3610 3199.5916 3566.3521
redmass: 3.0510 4.2708 1.6902 2.8823 2.2588 2.3903 1.4872 1.2895 1.5277 1.1209 3.6973 3.7450 3.4114 3.0573 2.3556 3.2606 1.1226 5.7103 3.7644 3.0671 3.2297 5.0007 3.4371 3.4062 1.0686 4.4339 1.1774 1.3905 1.4120 1.7517 1.6592 1.8245 2.7251 3.9166 1.5500 1.6215 1.6179 1.5580 2.5902 2.3516 2.0248 1.8409 2.6705 1.6278 1.5984 1.4100 1.2690 1.2169 1.1215 1.6138 1.5452 2.4526 2.2913 1.2024 1.2119 1.2226 1.8082 1.2741 1.0662 1.0898 1.0594 1.3121 1.0419 1.1035 1.0992 2.1524 1.2300 7.1687 6.1492 1.0596 1.0377 1.0580 1.0416 1.0414 1.1006 1.1037 1.0601 1.0950 1.1011 1.0949 1.0993 1.1034 1.0994 1.0997 1.0939 1.0946 1.0669
irintensity: 0.5192 0.1630 0.0493 0.0972 0.6476 4.0611 1.2171 0.0264 1.8546 0.0751 0.0843 7.2841 1.2913 1.7448 0.1396 7.5309 161.3529 5.2514 4.6237 0.8370 2.9405 1.0037 5.7911 2.5779 7.9039 0.2147 0.3004 24.1506 18.4814 3.4561 6.3850 4.9363 3.3701 0.1973 13.9808 7.9978 16.8680 2.3158 0.7204 37.2977 284.3008 2.1936 9.6856 1.8014 2.3734 3.5887 0.5081 5.4146 5.1768 29.1746 6.8148 6.6769 29.8861 11.8066 40.6687 13.8721 2.8346 29.4047 21.5781 10.3874 3.7310 42.2056 16.6720 6.8655 41.9725 19.9765 19.5538 123.7384 277.0759 18.4165 17.0865 33.4452 0.2216 0.4027 1.6965 21.1779 14.1296 3.7925 49.4586 2.9306 27.5030 14.4614 4.3907 0.7790 0.3128 2.8693 147.2199
temp: 298.150 k
press: 1.00000 atm
elementType: 8 7 6 6 6 6 6 6 6 6 6 6 6 1 1 1 1 1 1 1 1 1 1 1 1 1 1 1 1 1 1
symmnumber: 1
zpe: 710582.4 jmol-1
zpe.correction: 0.270647 hartree
zpe.thermalcorrener: 0.284919 hartree
zpe.thermalcorrenthalpy: 0.285863 hartree
zpe.thermalcorrgfe: 0.229417 hartree
zpe.sumelectzpe: -558.721556 hartree
zpe.sumelectthermal: -558.707284 hartree
zpe.sumelectthermalent: -558.706340 hartree
zpe.sumelectthermalfe: -558.762786 hartree
dipole: -2.3796 1.6760 -0.9583
dipole: 3.0642
quadrupole: -46.6335 -56.9779 -76.1508
quadrupole: -8.4984 -4.6002 1.8023
quadrupole: 13.2872 2.9428 -16.2300 -8.4984 -4.6002 1.8023
hfenergy: -558.992203 hartree
pointgroup: C01 [X(C11H18N1O1)]
dipole: 0.9298031 -0.6617764 -0.3884222 debye
polarizability: 170.8856353|-2.2984671|132.2252131|13.8383528|-0.2207995|85.1408797 unknown
InChI: InChI=1S/C11H18NO/c1-4-5-6-12-9(2)7-11(13)8-10(12)3/h7-8,13H,4-6H2,1-3H3
charge 1 multiplicity 1
31 atoms
O  4.047946 0.062622 0.7924
N  0.072795 -0.010541 -0.470484
C  -1.383227 -0.000445 -0.855987
C  -2.328865 -0.005315 0.369068
C  0.721807 -1.230229 -0.276025
C  0.733497 1.205739 -0.256469
C  -3.812472 0.01301 -0.072931
C  2.057975 -1.242211 0.146452
C  2.065342 1.198777 0.165299
C  2.746367 -0.024692 0.375937
C  -0.007845 -2.524212 -0.544309
C  0.013758 2.508424 -0.505825
C  -4.776287 0.003332 1.132802
H  -1.568552 0.889939 -1.475881
H  -1.578304 -0.877552 -1.491745
H  -2.123756 0.87271 1.01179
H  -2.140365 -0.90079 0.992699
H  -4.003895 0.911825 -0.692892
H  -4.018566 -0.8642 -0.718703
H  2.549962 -2.208242 0.291254
H  2.592131 2.139466 0.334465
H  -0.96366 -2.592229 0.001759
H  -0.224614 -2.652137 -1.621491
H  0.616148 -3.374902 -0.232313
H  0.647481 3.346965 -0.181522
H  -0.201651 2.654565 -1.581042
H  -0.941145 2.577945 0.041873
H  -5.827005 0.017597 0.795795
H  -4.635306 -0.901026 1.752536
H  -4.61971 0.885962 1.779489
H  4.494316 -0.812154 0.927801
